BDBM50528602 CHEMBL4567904
SMILES ONC(=O)CSC(c1cc(F)cc(F)c1)P(O)(O)=O
InChI Key InChIKey=CHWZNLZHQNRDMJ-UHFFFAOYSA-N
Data  3 IC50
  Tab Delimited (TSV)   2D SDfile   Computed 3D by Vconf -m prep SDfile
Find this compound or compounds like it in BindingDB:
Activity Spreadsheet -- Enzyme Inhibition Constant Data from BindingDB
Found 3 hits for monomerid = 50528602
Target1-deoxy-D-xylulose 5-phosphate reductoisomerase, apicoplastic(Plasmodium falciparum (isolate 3D7))
Heinrich Heine University D£Sseldorf
Curated by ChEMBL
LigandPNGBDBM50528602(CHEMBL4567904)
Affinity DataIC50:  11nM. Assay description: Inhibition of recombinant Plasmodium falciparum IspC expressed in Escherichia coli using 1-deoxy-D-xylulose 5-phosphate as substrate by photometric a...
Ligand InfoPC cidPC sid
In DepthDetails ArticlePubMed
Target1-deoxy-D-xylulose 5-phosphate reductoisomerase(Mycobacterium tuberculosis)
Heinrich Heine University D£Sseldorf
Curated by ChEMBL
LigandPNGBDBM50528602(CHEMBL4567904)
Affinity DataIC50:  320nM. Assay description: Inhibition of recombinant Mycobacterium tuberculosis IspC expressed in Escherichia coli M15 using 1-deoxy-D-xylulose 5-phosphate as substrate by phot...
Ligand InfoPC cidPC sid
In DepthDetails ArticlePubMed
Target1-deoxy-D-xylulose 5-phosphate reductoisomerase(Escherichia coli)
Heinrich Heine University D£Sseldorf
Curated by ChEMBL
LigandPNGBDBM50528602(CHEMBL4567904)
Affinity DataIC50:  13nM. Assay description: Inhibition of recombinant Escherichia coli IspC expressed in Escherichia coli M15 using 1-deoxy-D-xylulose 5-phosphate as substrate by photometric as...
Ligand InfoPC cidPC sid
In DepthDetails ArticlePubMed