BDBM50532167 CHEMBL4460961
SMILES Cc1ccc2nc(cc(C(=O)OCc3ccccc3)c2c1)-c1ccc(F)cc1
InChI Key InChIKey=JWSCZDUDYWOXND-UHFFFAOYSA-N
Data  1 IC50
  Tab Delimited (TSV)   2D SDfile   Computed 3D by Vconf -m prep SDfile
Find this compound or compounds like it in BindingDB:
Activity Spreadsheet -- Enzyme Inhibition Constant Data from BindingDB
Found 1 hit for monomerid = 50532167
TargetDihydroorotate dehydrogenase (quinone), mitochondrial(Homo sapiens (Human))
Nirma University
Curated by ChEMBL
LigandPNGBDBM50532167(CHEMBL4460961)
Affinity DataIC50:  1.56E+3nM. Assay description: Inhibition of human recombinant N-terminal His-tagged DHODH (31 to 395 residues) expressed in Escherichia coli using DHO as substrate measured after ...
Ligand InfoPC cidPC sid
In DepthDetails ArticlePubMed