BDBM50532406 CHEMBL4545331
SMILES OC(=O)C(F)(F)F.OC(=O)C(F)(F)F.OC(=O)C(F)(F)F.[H][C@]1(Cc2ccc(NC(=O)CCN3CCN(CC3)CCC(=O)Nc3ccc(C[C@]([H])(NC1=O)C(=O)NCc1ccc(cc1)C(N)=N)cc3)cc2)NC(=O)OCc1ccccc1
InChI Key InChIKey=WAKHSGZPGZIDOP-BYQQZPSGSA-N
Data  12 KI
  Tab Delimited (TSV)   2D SDfile   Computed 3D by Vconf -m prep SDfile
Find this compound or compounds like it in BindingDB:
Activity Spreadsheet -- Enzyme Inhibition Constant Data from BindingDB
Found 12 hits for monomerid = 50532406
TargetPlasminogen(Homo sapiens (Human))
Philipps University Marburg
Curated by ChEMBL
LigandPNGBDBM50532406(CHEMBL4545331)
Affinity DataKi:  0.770nM. Assay description: Inhibition of human plasmin using Mes-DSer(Bzl)-Phe-Arg-AMC as substrate by Dixon plot analysis
Ligand InfoPC cidPC sid
In DepthDetails ArticlePubMed
TargetPlasminogen(Homo sapiens (Human))
Philipps University Marburg
Curated by ChEMBL
LigandPNGBDBM50532406(CHEMBL4545331)
Affinity DataKi:  0.770nM. Assay description: Inhibition of human plasmin using Mes-DSer(Bzl)-Phe-Arg-AMC as substrate by Dixon plot analysis
Ligand InfoPC cidPC sid
In DepthDetails ArticlePubMed
TargetTrypsin(Sus scrofa)
Philipps University Marburg
Curated by ChEMBL
LigandPNGBDBM50532406(CHEMBL4545331)
Affinity DataKi:  103nM. Assay description: Inhibition of porcine trypsin using Mes-DArg-Gly-Arg-AMC as substrate by Dixon plot analysis
Ligand InfoPC cidPC sid
In DepthDetails ArticlePubMed
TargetTrypsin(Sus scrofa)
Philipps University Marburg
Curated by ChEMBL
LigandPNGBDBM50532406(CHEMBL4545331)
Affinity DataKi:  103nM. Assay description: Inhibition of porcine trypsin using Mes-DArg-Gly-Arg-AMC as substrate by Dixon plot analysis
Ligand InfoPC cidPC sid
In DepthDetails ArticlePubMed
TargetPlasma kallikrein(Homo sapiens (Human))
Philipps University Marburg
Curated by ChEMBL
LigandPNGBDBM50532406(CHEMBL4545331)
Affinity DataKi:  6.95E+3nM. Assay description: Inhibition of human plasma kallikrein using Mes-DArg-Pro-Arg-AMC as substrate by Dixon plot analysis
Ligand InfoPC cidPC sid
In DepthDetails ArticlePubMed
TargetPlasma kallikrein(Homo sapiens (Human))
Philipps University Marburg
Curated by ChEMBL
LigandPNGBDBM50532406(CHEMBL4545331)
Affinity DataKi:  6.95E+3nM. Assay description: Inhibition of human plasma kallikrein using Mes-DArg-Pro-Arg-AMC as substrate by Dixon plot analysis
Ligand InfoPC cidPC sid
In DepthDetails ArticlePubMed
TargetProthrombin(Bos taurus (Bovine))
Philipps University Marburg
Curated by ChEMBL
LigandPNGBDBM50532406(CHEMBL4545331)
Affinity DataKi:  4.40E+4nM. Assay description: Inhibition of bovine thrombin using Tos-Gly-Pro-Arg-AMC as substrate by Dixon plot analysis
Ligand InfoPC cidPC sid
In DepthDetails ArticlePubMed
TargetProthrombin(Bos taurus (Bovine))
Philipps University Marburg
Curated by ChEMBL
LigandPNGBDBM50532406(CHEMBL4545331)
Affinity DataKi:  4.40E+4nM. Assay description: Inhibition of bovine thrombin using Tos-Gly-Pro-Arg-AMC as substrate by Dixon plot analysis
Ligand InfoPC cidPC sid
In DepthDetails ArticlePubMed
TargetVitamin K-dependent protein C(Homo sapiens (Human))
Philipps University Marburg
Curated by ChEMBL
LigandPNGBDBM50532406(CHEMBL4545331)
Affinity DataKi:  4.65E+4nM. Assay description: Inhibition of human activated Protein C using Mes-DArg-Pro-Arg-AMC as substrate by Dixon plot analysis
Ligand InfoPC cidPC sid
In DepthDetails ArticlePubMed
TargetVitamin K-dependent protein C(Homo sapiens (Human))
Philipps University Marburg
Curated by ChEMBL
LigandPNGBDBM50532406(CHEMBL4545331)
Affinity DataKi:  4.65E+4nM. Assay description: Inhibition of human activated Protein C using Mes-DArg-Pro-Arg-AMC as substrate by Dixon plot analysis
Ligand InfoPC cidPC sid
In DepthDetails ArticlePubMed
TargetCoagulation factor X(Homo sapiens (Human))
Philipps University Marburg
Curated by ChEMBL
LigandPNGBDBM50532406(CHEMBL4545331)
Affinity DataKi:  4.74E+4nM. Assay description: Inhibition of human f10a using Mes-DArg-Pro-Arg-AMC as substrate by Dixon plot analysis
Ligand InfoPC cidPC sid
In DepthDetails ArticlePubMed
TargetCoagulation factor X(Homo sapiens (Human))
Philipps University Marburg
Curated by ChEMBL
LigandPNGBDBM50532406(CHEMBL4545331)
Affinity DataKi:  4.74E+4nM. Assay description: Inhibition of human f10a using Mes-DArg-Pro-Arg-AMC as substrate by Dixon plot analysis
Ligand InfoPC cidPC sid
In DepthDetails ArticlePubMed