BDBM50534379 CHEMBL4483388
SMILES CCCCCCCCCCCCCC[C@@H](OP(O)(O)=O)[C@@H](O)CCCO
InChI Key InChIKey=PVLYGYSHWHOEFU-RBUKOAKNSA-N
Data  1 IC50
  Tab Delimited (TSV)   2D SDfile   Computed 3D by Vconf -m prep SDfile
Find this compound or compounds like it in BindingDB:
Activity Spreadsheet -- Enzyme Inhibition Constant Data from BindingDB
Found 1 hit for monomerid = 50534379
TargetTyrosine-protein phosphatase non-receptor type 1(Homo sapiens (Human))
University Of Naples Federico Ii
Curated by ChEMBL
LigandPNGBDBM50534379(CHEMBL4483388)
Affinity DataIC50:  2.40E+4nM. Assay description: Inhibition of human recombinant PTP1B catalytic domain expressed in Escherichia coli strain BL21(DE3) using pNNP as substrate
Ligand InfoPC cidPC sid
In DepthDetails ArticlePubMed