BDBM50534380 CHEMBL4589821
SMILES OCCC[C@@H](O)CCCCCCC(=O)NCC(O)=O
InChI Key InChIKey=NHENZQJUJORFFG-NSHDSACASA-N
Data  1 IC50
  Tab Delimited (TSV)   2D SDfile   Computed 3D by Vconf -m prep SDfile
Find this compound or compounds like it in BindingDB:
Activity Spreadsheet -- Enzyme Inhibition Constant Data from BindingDB
Found 1 hit for monomerid = 50534380
TargetTyrosine-protein phosphatase non-receptor type 1(Homo sapiens (Human))
University Of Naples Federico Ii
Curated by ChEMBL
LigandPNGBDBM50534380(CHEMBL4589821)
Affinity DataIC50:  2.80E+4nM. Assay description: Inhibition of human recombinant PTP1B catalytic domain expressed in Escherichia coli strain BL21(DE3) using pNNP as substrate
Ligand InfoPC cidPC sid
In DepthDetails ArticlePubMed