BDBM50538225 CHEMBL4639338
SMILES Cc1cccc(Nc2ccccc2C(O)=O)c1-c1ccccc1
InChI Key InChIKey=MKJAELIEDWRWAI-UHFFFAOYSA-N
Data  1 KI
  Tab Delimited (TSV)   2D SDfile   Computed 3D by Vconf -m prep SDfile
Find this compound or compounds like it in BindingDB:
Activity Spreadsheet -- Enzyme Inhibition Constant Data from BindingDB
Found 1 hit for monomerid = 50538225
TargetFatty acid-binding protein, adipocyte(Homo sapiens (Human))
Chinese Academy Of Sciences
Curated by ChEMBL
LigandPNGBDBM50538225(CHEMBL4639338)
Affinity DataKi:  182nM. Assay description: Displacement of 1,8-ANS from recombinant human 6His-tagged FABP4 expressed in Escherichia coli BL21 DE3 incubated for 15 mins followed by 1,8-ANS add...
Ligand InfoPC cidPC sid
In DepthDetails ArticlePubMed