BDBM50538397 CHEMBL4633769
SMILES Cc1ccc(cc1)S(=O)(=O)NS(=O)(=O)Nc1c2CCCc2cc2CCCc12
InChI Key InChIKey=BWNQHSLVHWHLBH-UHFFFAOYSA-N
Data  1 IC50
  Tab Delimited (TSV)   2D SDfile   Computed 3D by Vconf -m prep SDfile
Find this compound or compounds like it in BindingDB:
Activity Spreadsheet -- Enzyme Inhibition Constant Data from BindingDB
Found 1 hit for monomerid = 50538397
TargetNACHT, LRR and PYD domains-containing protein 3(Homo sapiens (Human))
Cadila Healthcare
Curated by ChEMBL
LigandPNGBDBM50538397(CHEMBL4633769)
Affinity DataIC50: >1.00E+3nM. Assay description: Inhibition of NLRP3 inflammasome activation in LPS-primed human THP1 cells assessed as reduction in IL-1beta level preincubated for 1 hr followed by ...
Ligand InfoPC cidPC sid
In DepthDetails ArticlePubMed