BDBM50538404 CHEMBL4636808
SMILES O=C(NC(C#N)c1ccccc1)Nc1c2CCCc2cc2CCCc12
InChI Key InChIKey=ZEQAAZWCPRSSMY-UHFFFAOYSA-N
Data  1 IC50
  Tab Delimited (TSV)   2D SDfile   Computed 3D by Vconf -m prep SDfile
Find this compound or compounds like it in BindingDB:
Activity Spreadsheet -- Enzyme Inhibition Constant Data from BindingDB
Found 1 hit for monomerid = 50538404
TargetNACHT, LRR and PYD domains-containing protein 3(Homo sapiens (Human))
Cadila Healthcare
Curated by ChEMBL
LigandPNGBDBM50538404(CHEMBL4636808)
Affinity DataIC50: >1.00E+3nM. Assay description: Inhibition of NLRP3 inflammasome activation in LPS-primed human THP1 cells assessed as reduction in IL-1beta level preincubated for 1 hr followed by ...
Ligand InfoPC cidPC sid
In DepthDetails ArticlePubMed