BDBM50538743 CHEMBL4640669
SMILES Fc1ccc(cc1)C1=NN(C(C1)c1cccc2ccccc12)c1ccc(cc1)C(=O)N1CCOCC1
InChI Key InChIKey=QTOUVRBRNSQRKV-UHFFFAOYSA-N
Data  1 IC50  1 Kd
  Tab Delimited (TSV)   2D SDfile   Computed 3D by Vconf -m prep SDfile
Find this compound or compounds like it in BindingDB:
Activity Spreadsheet -- Enzyme Inhibition Constant Data from BindingDB
Found 2 hits for monomerid = 50538743
TargetAdenomatous polyposis coli protein(Homo sapiens (Human))
Nanjing University
Curated by ChEMBL
LigandPNGBDBM50538743(CHEMBL4640669)
Affinity DataKd:  1.28E+4nM. Assay description: Binding affinity to APC (unknown origin) by isothermal titration calorimetry assay
Ligand InfoPC cidPC sid
In DepthDetails ArticlePubMed
TargetAdenomatous polyposis coli protein(Homo sapiens (Human))
Nanjing University
Curated by ChEMBL
LigandPNGBDBM50538743(CHEMBL4640669)
Affinity DataIC50:  180nM. Assay description: Binding affinity to APC (unknown origin) assessed as inhibition of APC-Asef protein-protein interaction after 2 hrs by fluorescence polarization immu...
Ligand InfoPC cidPC sid
In DepthDetails ArticlePubMed