BDBM50538811 CHEMBL4640223
SMILES CC[C@H](NC(=O)[C@H](Cc1ccccc1)NC(=O)c1ccc(Br)cc1)C(=O)N[C@@H](Cc1ccccc1)C(=O)N[C@@H](CCCC[N+](C)(C)C)C(=O)N[C@@H](CO)C(=O)N[C@@H](CCC(O)=O)C(=O)N[C@@H](CCCCNC(=S)Nc1ccc(c(c1)C(O)=O)-c1c2ccc(O)cc2oc2cc(=O)ccc12)C(N)=O
InChI Key InChIKey=JZLPRLQRTFDCLM-MQEJUTFJSA-O
Data  6 Kd
  Tab Delimited (TSV)   2D SDfile   Computed 3D by Vconf -m prep SDfile
Find this compound or compounds like it in BindingDB:
Activity Spreadsheet -- Enzyme Inhibition Constant Data from BindingDB
Found 6 hits for monomerid = 50538811
TargetChromobox protein homolog 1(Homo sapiens (Human))
University Of Victoria
Curated by ChEMBL
LigandPNGBDBM50538811(CHEMBL4640223)
Affinity DataKd:  1.80E+5nM. Assay description: Binding affinity to CBX1 (unknown origin) assessed as dissociation constant by fluorescence polarization analysis
Ligand InfoKEGGPC cidPC sid
In DepthDetails ArticlePubMed
TargetChromobox protein homolog 2(Homo sapiens (Human))
University Of Victoria
Curated by ChEMBL
LigandPNGBDBM50538811(CHEMBL4640223)
Affinity DataKd:  1.50E+3nM. Assay description: Binding affinity to CBX2 (unknown origin) assessed as dissociation constant by fluorescence polarization analysis
Ligand InfoKEGGPC cidPC sid
In DepthDetails ArticlePubMed
TargetChromobox protein homolog 8(Homo sapiens (Human))
University Of Victoria
Curated by ChEMBL
LigandPNGBDBM50538811(CHEMBL4640223)
Affinity DataKd:  960nM. Assay description: Binding affinity to CBX8 (unknown origin) assessed as dissociation constant by fluorescence polarization analysis
Ligand InfoKEGGPC cidPC sid
In DepthDetails ArticlePubMed
TargetChromobox protein homolog 6(Homo sapiens (Human))
University Of Victoria
Curated by ChEMBL
LigandPNGBDBM50538811(CHEMBL4640223)
Affinity DataKd:  800nM. Assay description: Binding affinity to CBX6 (unknown origin) assessed as dissociation constant by fluorescence polarization analysis
Ligand InfoKEGGPC cidPC sid
In DepthDetails ArticlePubMed
TargetChromobox protein homolog 7(Homo sapiens (Human))
University Of Victoria
Curated by ChEMBL
LigandPNGBDBM50538811(CHEMBL4640223)
Affinity DataKd:  300nM. Assay description: Binding affinity to CBX7 (unknown origin) assessed as dissociation constant by fluorescence polarization analysis
Ligand InfoKEGGPC cidPC sid
In DepthDetails ArticlePubMed
TargetE3 SUMO-protein ligase CBX4(Homo sapiens (Human))
University Of Victoria
Curated by ChEMBL
LigandPNGBDBM50538811(CHEMBL4640223)
Affinity DataKd:  700nM. Assay description: Binding affinity to CBX4 (unknown origin) assessed as dissociation constant by fluorescence polarization analysis
Ligand InfoKEGGPC cidPC sid
In DepthDetails ArticlePubMed