BDBM50540184 CHEMBL4643627
SMILES CC(=O)N1CCC(CC1)c1nsc(Nc2ncc(Sc3ccccn3)cc2Oc2cccc3ncccc23)n1
InChI Key InChIKey=JNDNJMYZHYPZGD-UHFFFAOYSA-N
Data  2 EC50
  Tab Delimited (TSV)   2D SDfile   Computed 3D by Vconf -m prep SDfile
Find this compound or compounds like it in BindingDB:
Activity Spreadsheet -- Enzyme Inhibition Constant Data from BindingDB
Found 2 hits for monomerid = 50540184
TargetHexokinase-4(Homo sapiens (Human))
Array Biopharma
Curated by ChEMBL
LigandPNGBDBM50540184(CHEMBL4643627)
Affinity DataEC50:  504nM. Assay description: Activation of glucokinase (unknown origin) in presence of 4% human serum albumin
Ligand InfoPC cidPC sid
In DepthDetails ArticlePubMed
TargetHexokinase-4(Homo sapiens (Human))
Array Biopharma
Curated by ChEMBL
LigandPNGBDBM50540184(CHEMBL4643627)
Affinity DataEC50:  9.30nM. Assay description: Activation of glucokinase (unknown origin)
Ligand InfoPC cidPC sid
In DepthDetails ArticlePubMed