BDBM50541861 CHEMBL4645057
SMILES CNC(=O)c1csc(n1)[C@@H]1C[C@@H](CN1C(C)=O)NC(=O)[C@@H]1CC(=O)N(C)C(=O)N1
InChI Key InChIKey=DQHYRKSWVXNBGA-NHCYSSNCSA-N
Data  1 IC50
  Tab Delimited (TSV)   2D SDfile   Computed 3D by Vconf -m prep SDfile
Find this compound or compounds like it in BindingDB:
Activity Spreadsheet -- Enzyme Inhibition Constant Data from BindingDB
Found 1 hit for monomerid = 50541861
TargetN-alpha-acetyltransferase 50(Homo sapiens)
Pfizer
Curated by ChEMBL
LigandPNGBDBM50541861(CHEMBL4645057)
Affinity DataIC50:  1.30E+4nM. Assay description: Inhibition of wild type human Naa50 (1852 to 2082 residues) expressed in Escherichia coli BL21(DE3) cells using MLGPEGGEGK peptide as substrate after...
Ligand InfoPC cidPC sid
In DepthDetails ArticlePubMed