BDBM50544552 CHEMBL4639521
SMILES CN(CCc1ccccc1)C(=O)C(=O)CCc1ccc(Cl)cc1
InChI Key InChIKey=YIBFCBAFHNFNGC-UHFFFAOYSA-N
Data  4 IC50
  Tab Delimited (TSV)   2D SDfile   Computed 3D by Vconf -m prep SDfile
Find this compound or compounds like it in BindingDB:
Activity Spreadsheet -- Enzyme Inhibition Constant Data from BindingDB
Found 4 hits for monomerid = 50544552
TargetPhospholipase A and acyltransferase 2(Homo sapiens)
Leiden University & Oncode Institute
Curated by ChEMBL
LigandPNGBDBM50544552(CHEMBL4639521)
Affinity DataIC50: <1.00E+4nM. Assay description: Inhibition of full-length C-terminal FLAG-tagged human PLAAT2 expressed in HEK293T cell lysate preincubated for 30 mins followed by MB064 addition an...
Ligand InfoPC cidPC sid
In DepthDetails ArticlePubMed
TargetPhospholipase A and acyltransferase 5(Homo sapiens)
Leiden University & Oncode Institute
Curated by ChEMBL
LigandPNGBDBM50544552(CHEMBL4639521)
Affinity DataIC50: <1.00E+4nM. Assay description: Inhibition of full-length C-terminal FLAG-tagged human PLAAT5 expressed in HEK293T cell lysate preincubated for 30 mins followed by MB064 addition an...
Ligand InfoPC cidPC sid
In DepthDetails ArticlePubMed
TargetPhospholipase A and acyltransferase 4(Homo sapiens)
Leiden University & Oncode Institute
Curated by ChEMBL
LigandPNGBDBM50544552(CHEMBL4639521)
Affinity DataIC50: <1.00E+4nM. Assay description: Inhibition of full-length C-terminal FLAG-tagged human PLAAT4 expressed in HEK293T cell lysate preincubated for 30 mins followed by MB064 addition an...
Ligand InfoPC cidPC sid
In DepthDetails ArticlePubMed
TargetPhospholipase A and acyltransferase 3(Homo sapiens)
Leiden University & Oncode Institute
Curated by ChEMBL
LigandPNGBDBM50544552(CHEMBL4639521)
Affinity DataIC50: <1.00E+4nM. Assay description: Inhibition of full-length C-terminal FLAG-tagged human PLAAT3 expressed in HEK293T cell lysate preincubated for 30 mins followed by MB064 addition an...
Ligand InfoPC cidPC sid
In DepthDetails ArticlePubMed