BDBM50544585 CHEMBL4643908
SMILES COc1ccc(CCNC(=O)C(=O)CCCc2ccccc2)cc1OC
InChI Key InChIKey=NNBYHRRMRFFJJK-UHFFFAOYSA-N
Data  4 IC50
  Tab Delimited (TSV)   2D SDfile   Computed 3D by Vconf -m prep SDfile
Find this compound or compounds like it in BindingDB:
Activity Spreadsheet -- Enzyme Inhibition Constant Data from BindingDB
Found 4 hits for monomerid = 50544585
TargetPhospholipase A and acyltransferase 2(Homo sapiens)
Leiden University & Oncode Institute
Curated by ChEMBL
LigandPNGBDBM50544585(CHEMBL4643908)
Affinity DataIC50:  5.01E+3nM. Assay description: Inhibition of full-length C-terminal FLAG-tagged human PLAAT2 expressed in HEK293T cell lysate preincubated for 30 mins followed by MB064 addition an...
Ligand InfoPC cidPC sid
In DepthDetails ArticlePubMed
TargetPhospholipase A and acyltransferase 5(Homo sapiens)
Leiden University & Oncode Institute
Curated by ChEMBL
LigandPNGBDBM50544585(CHEMBL4643908)
Affinity DataIC50:  316nM. Assay description: Inhibition of full-length C-terminal FLAG-tagged human PLAAT5 expressed in HEK293T cell lysate preincubated for 30 mins followed by MB064 addition an...
Ligand InfoPC cidPC sid
In DepthDetails ArticlePubMed
TargetPhospholipase A and acyltransferase 4(Homo sapiens)
Leiden University & Oncode Institute
Curated by ChEMBL
LigandPNGBDBM50544585(CHEMBL4643908)
Affinity DataIC50:  6.31E+3nM. Assay description: Inhibition of full-length C-terminal FLAG-tagged human PLAAT4 expressed in HEK293T cell lysate preincubated for 30 mins followed by MB064 addition an...
Ligand InfoPC cidPC sid
In DepthDetails ArticlePubMed
TargetPhospholipase A and acyltransferase 3(Homo sapiens)
Leiden University & Oncode Institute
Curated by ChEMBL
LigandPNGBDBM50544585(CHEMBL4643908)
Affinity DataIC50:  1.00E+3nM. Assay description: Inhibition of full-length C-terminal FLAG-tagged human PLAAT3 expressed in HEK293T cell lysate preincubated for 30 mins followed by MB064 addition an...
Ligand InfoPC cidPC sid
In DepthDetails ArticlePubMed