BDBM50545542 CHEMBL4641912
SMILES [H][C@@]12CCc3cc(OCc4c(F)cccc4C(F)(F)F)ccc3[C@@]1(CCN2C(=O)[C@@]1(C)CC[C@@H](CC1)C(O)=O)S(=O)(=O)c1ccc(F)cc1
InChI Key InChIKey=IQMRENBCQAZPJJ-IOHSOSRPSA-N
Data  4 EC50
  Tab Delimited (TSV)   2D SDfile   Computed 3D by Vconf -m prep SDfile
Find this compound or compounds like it in BindingDB:
Activity Spreadsheet -- Enzyme Inhibition Constant Data from BindingDB
Found 4 hits for monomerid = 50545542
TargetNuclear receptor ROR-alpha(Homo sapiens (Human))
Bristol Myers Squibb
Curated by ChEMBL
LigandPNGBDBM50545542(CHEMBL4641912)
Affinity DataEC50:  4.20E+3nM. Assay description: Agonist activity at Gal4-fused RORalpha (unknown origin)
Ligand InfoPC cidPC sid
In DepthDetails ArticlePubMed
TargetNuclear receptor ROR-gamma(Homo sapiens (Human))
Bristol Myers Squibb
Curated by ChEMBL
LigandPNGBDBM50545542(CHEMBL4641912)
Affinity DataEC50:  13nM. Assay description: Agonist activity at GAL-4 fused RORgammat (unknown origin) expressed in Jurkat cells by luciferase reporter gene assay
Ligand InfoPC cidPC sid
In DepthDetails ArticlePubMed
TargetNuclear receptor ROR-gamma(Mus musculus)
Bristol Myers Squibb
Curated by ChEMBL
LigandPNGBDBM50545542(CHEMBL4641912)
Affinity DataEC50:  380nM. Assay description: Agonist activity at RORgammat in mouse whole blood assessed as induction of IL-17A expression
Ligand InfoPC cidPC sid
In DepthDetails ArticlePubMed
TargetNuclear receptor ROR-beta(Homo sapiens (Human))
Bristol Myers Squibb
Curated by ChEMBL
LigandPNGBDBM50545542(CHEMBL4641912)
Affinity DataEC50:  1.00E+4nM. Assay description: Agonist activity at Gal4-fused RORbeta (unknown origin)
Ligand InfoPC cidPC sid
In DepthDetails ArticlePubMed