BDBM50546887 CHEMBL4742865
SMILES CCCCC\N=C(/C)c1c(O)c2ccccc2oc1=O
InChI Key InChIKey=ABLRUWAXOWUJKO-GZTJUZNOSA-N
Data  1 IC50
  Tab Delimited (TSV)   2D SDfile   Computed 3D by Vconf -m prep SDfile
Find this compound or compounds like it in BindingDB:
Activity Spreadsheet -- Enzyme Inhibition Constant Data from BindingDB
Found 1 hit for monomerid = 50546887
TargetMyosin-2(Bos taurus)
University Of Nevada
Curated by ChEMBL
LigandPNGBDBM50546887(CHEMBL4742865)
Affinity DataIC50:  6.70E+3nM. Assay description: Inhibition of actin-activated bovine heart muscle myosin 2 assessed as phosphate level incubated for 6 to 24 mins by spectrophotometric method
Ligand InfoPC cidPC sid
In DepthDetails ArticlePubMed