BDBM50546888 CHEMBL4800510
SMILES CCCCCC\N=C(/C)c1c(O)c2ccccc2oc1=O
InChI Key InChIKey=DDGWWWXGUMPEQP-LDADJPATSA-N
Data  1 IC50
  Tab Delimited (TSV)   2D SDfile   Computed 3D by Vconf -m prep SDfile
Find this compound or compounds like it in BindingDB:
Activity Spreadsheet -- Enzyme Inhibition Constant Data from BindingDB
Found 1 hit for monomerid = 50546888
TargetMyosin-2(Bos taurus)
University Of Nevada
Curated by ChEMBL
LigandPNGBDBM50546888(CHEMBL4800510)
Affinity DataIC50:  2.90E+3nM. Assay description: Inhibition of actin-activated bovine heart muscle myosin 2 assessed as phosphate level incubated for 6 to 24 mins by spectrophotometric method
Ligand InfoPC cidPC sid
In DepthDetails ArticlePubMed