BDBM50546889 CHEMBL4763227
SMILES C\C(=N/CCO)c1c(O)c2ccccc2oc1=O
InChI Key InChIKey=MMGMQMKACABQDU-RIYZIHGNSA-N
Data  1 IC50
  Tab Delimited (TSV)   2D SDfile   Computed 3D by Vconf -m prep SDfile
Find this compound or compounds like it in BindingDB:
Activity Spreadsheet -- Enzyme Inhibition Constant Data from BindingDB
Found 1 hit for monomerid = 50546889
TargetMyosin-2(Bos taurus)
University Of Nevada
Curated by ChEMBL
LigandPNGBDBM50546889(CHEMBL4763227)
Affinity DataIC50:  9.20E+4nM. Assay description: Inhibition of actin-activated bovine heart muscle myosin 2 assessed as phosphate level incubated for 6 to 24 mins by spectrophotometric method
Ligand InfoPC cidPC sid
In DepthDetails ArticlePubMed