BDBM50546973 CHEMBL4782843::US11247971, Cmpd ID 258
SMILES NS(=O)(=O)c1ccc(Cc2c(CC3CC3)n(nc2-c2ccc(F)c(c2)C#CC2CCCC2)-c2nc(cs2)C(O)=O)cc1F
InChI Key InChIKey=KTCLNOGFWLXRFB-UHFFFAOYSA-N
Data  4 IC50  1 Kd
PDB links: 1 PDB ID matches this monomer.
  Tab Delimited (TSV)   2D SDfile   Computed 3D by Vconf -m prep SDfile
Find this compound or compounds like it in BindingDB:
Activity Spreadsheet -- Enzyme Inhibition Constant Data from BindingDB
Found 5 hits for monomerid = 50546973
TargetL-lactate dehydrogenase A chain(Homo sapiens (Human))
National Institutes Of Health
Curated by ChEMBL
LigandPNGBDBM50546973(CHEMBL4782843 | US11247971, Cmpd ID 258)
Affinity DataKd:  0.0193nM. Assay description: Binding affinity to human His-tagged LDHA by SPR analysis
Ligand InfoPC cidPC sidPDB
TargetL-lactate dehydrogenase A chain(Homo sapiens (Human))
National Institutes Of Health
Curated by ChEMBL
LigandPNGBDBM50546973(CHEMBL4782843 | US11247971, Cmpd ID 258)
Affinity DataIC50:  22nM. Assay description: Inhibition of recombinant human LDHA using sodium pyruvate as substrate preincubated for 5 mins followed by diaphorase/resazurin addition and measure...
Ligand InfoPC cidPC sidPDB
TargetL-lactate dehydrogenase A chain(Homo sapiens (Human))
National Institutes Of Health
Curated by ChEMBL
LigandPNGBDBM50546973(CHEMBL4782843 | US11247971, Cmpd ID 258)
Affinity DataIC50:  112nM. Assay description: Inhibition of GS[HiBiT]GS-tagged LDHA (unknown origin) expressed in HEK-293T cells measured after 1 hr by CESTA
Ligand InfoPC cidPC sidPDB
TargetL-lactate dehydrogenase A chain(Homo sapiens (Human))
National Institutes Of Health
Curated by ChEMBL
LigandPNGBDBM50546973(CHEMBL4782843 | US11247971, Cmpd ID 258)
Affinity DataIC50:  333nM. Assay description: Inhibition of LDHA in human MIA PaCa-2 cells assessed as decrease in lactate production incubated for 2 hrs by lactate oxidase-coupled fluorescence b...
Ligand InfoPC cidPC sidPDB
TargetL-lactate dehydrogenase A chain(Homo sapiens (Human))
National Institutes Of Health
Curated by ChEMBL
LigandPNGBDBM50546973(CHEMBL4782843 | US11247971, Cmpd ID 258)
Affinity DataIC50:  509nM. Assay description: Inhibition of LDHA in human A673 cells assessed as decrease in lactate production incubated for 2 hrs by lactate oxidase-coupled fluorescence based a...
Ligand InfoPC cidPC sidPDB