BDBM50547639 CHEMBL4744183
SMILES Cl.Cl.COC(=O)N[C@@H](C(C)C)C(=O)N1CCC[C@H]1c1ncc([nH]1)-c1ccc(C#CC#Cc2cnc([nH]2)[C@@H]2CCCN2C(=O)[C@H](NC(=O)OC)c2ccccc2)c(Oc2ccccc2)c1
InChI Key InChIKey=CWJRDNGZRHLLDL-DLNRLFIKSA-N
Data  6 IC50
  Tab Delimited (TSV)   2D SDfile   Computed 3D by Vconf -m prep SDfile
Find this compound or compounds like it in BindingDB:
Activity Spreadsheet -- Enzyme Inhibition Constant Data from BindingDB
Found 6 hits for monomerid = 50547639
TargetNonstructural protein 5A(Hepatitis C virus)
Chemical Diversity Research Institute
Curated by ChEMBL
LigandPNGBDBM50547639(CHEMBL4744183)
Affinity DataIC50:  0.0190nM. Assay description: Inhibition of HCV genotype 5a NS5A infected in Huh7 cells assessed as reduction in viral replication incubated 3 days and measured by bright Glo-luci...
Ligand InfoPC cidPC sid
In DepthDetails ArticlePubMed
TargetNonstructural protein 5A(Hepatitis C virus)
Chemical Diversity Research Institute
Curated by ChEMBL
LigandPNGBDBM50547639(CHEMBL4744183)
Affinity DataIC50:  0.0400nM. Assay description: Inhibition of HCV genotype 3a NS5A infected in Huh7 cells assessed as reduction in viral replication incubated 3 days and measured by bright Glo-luci...
Ligand InfoPC cidPC sid
In DepthDetails ArticlePubMed
TargetNonstructural protein 5A(Hepatitis C virus)
Chemical Diversity Research Institute
Curated by ChEMBL
LigandPNGBDBM50547639(CHEMBL4744183)
Affinity DataIC50:  0.0130nM. Assay description: Inhibition of HCV genotype 2a NS5A infected in Huh7 cells assessed as reduction in viral replication incubated 3 days and measured by bright Glo-luci...
Ligand InfoPC cidPC sid
In DepthDetails ArticlePubMed
TargetNonstructural protein 5A(Hepatitis C virus)
Chemical Diversity Research Institute
Curated by ChEMBL
LigandPNGBDBM50547639(CHEMBL4744183)
Affinity DataIC50:  0.214nM. Assay description: Inhibition of HCV genotype 1a NS5A infected in Huh7 cells assessed as reduction in viral replication incubated 3 days and measured by bright Glo-luci...
Ligand InfoPC cidPC sid
In DepthDetails ArticlePubMed
TargetNonstructural protein 5A(Hepatitis C virus)
Chemical Diversity Research Institute
Curated by ChEMBL
LigandPNGBDBM50547639(CHEMBL4744183)
Affinity DataIC50:  0.00200nM. Assay description: Inhibition of HCV genotype 1b NS5A infected in Huh7 cells assessed as reduction in viral replication incubated 3 days and measured by Celltiter Glo a...
Ligand InfoPC cidPC sid
In DepthDetails ArticlePubMed
TargetNonstructural protein 5A(Hepatitis C virus)
Chemical Diversity Research Institute
Curated by ChEMBL
LigandPNGBDBM50547639(CHEMBL4744183)
Affinity DataIC50:  0.00800nM. Assay description: Inhibition of HCV genotype 4a NS5A infected in Huh7 cells assessed as reduction in viral replication incubated 3 days and measured by bright Glo-luci...
Ligand InfoPC cidPC sid
In DepthDetails ArticlePubMed