BDBM50549522 CHEMBL4786038
SMILES Cc1nc(-c2cccc(c2)C#N)n(OCc2ccc(cc2)C#N)c1C(O)=O
InChI Key InChIKey=JLOKENLSGFWDSP-UHFFFAOYSA-N
Data  8 IC50
  Tab Delimited (TSV)   2D SDfile   Computed 3D by Vconf -m prep SDfile
Find this compound or compounds like it in BindingDB:
Activity Spreadsheet -- Enzyme Inhibition Constant Data from BindingDB
Found 8 hits for monomerid = 50549522
TargetCytochrome P450 3A4(Homo sapiens (Human))
Shenyang Pharmaceutical University
Curated by ChEMBL
LigandPNGBDBM50549522(CHEMBL4786038)
Affinity DataIC50: >1.00E+4nM. Assay description: Inhibition of CYP3A4 in human liver microsomes using testosterone as substrate preincubated for 5 mins followed by NADPH generating system addition a...
Ligand InfoPC cidPC sid
In DepthDetails ArticlePubMed
TargetCytochrome P450 2E1(Homo sapiens (Human))
Shenyang Pharmaceutical University
Curated by ChEMBL
LigandPNGBDBM50549522(CHEMBL4786038)
Affinity DataIC50: >1.00E+4nM. Assay description: Inhibition of CYP2E1 in human liver microsomes using chlorzoxazone as substrate preincubated for 5 mins followed by NADPH generating system addition ...
Ligand InfoPC cidPC sid
In DepthDetails ArticlePubMed
TargetCytochrome P450 2D6(Homo sapiens (Human))
Shenyang Pharmaceutical University
Curated by ChEMBL
LigandPNGBDBM50549522(CHEMBL4786038)
Affinity DataIC50: >1.00E+4nM. Assay description: Inhibition of CYP2D6 in human liver microsomes using dextromethorphan as substrate preincubated for 5 mins followed by NADPH generating system additi...
Ligand InfoPC cidPC sid
In DepthDetails ArticlePubMed
TargetP2Y purinoceptor 12(Homo sapiens (Human))
Shenyang Pharmaceutical University
Curated by ChEMBL
LigandPNGBDBM50549522(CHEMBL4786038)
Affinity DataIC50:  1.49E+5nM. Assay description: Antagonist activity at P2Y12 in human whole blood assessed as suppression of ADP-induced decrease in PGE1-induced VASP phosphorylation measured after...
Ligand InfoPC cidPC sid
In DepthDetails ArticlePubMed
TargetCytochrome P450 2C9(Homo sapiens (Human))
Shenyang Pharmaceutical University
Curated by ChEMBL
LigandPNGBDBM50549522(CHEMBL4786038)
Affinity DataIC50: >1.00E+4nM. Assay description: Inhibition of CYP2C9 in human liver microsomes using tolbutamide as substrate preincubated for 5 mins followed by NADPH generating system addition an...
Ligand InfoPC cidPC sid
In DepthDetails ArticlePubMed
TargetCytochrome P450 2A6(Homo sapiens (Human))
Shenyang Pharmaceutical University
Curated by ChEMBL
LigandPNGBDBM50549522(CHEMBL4786038)
Affinity DataIC50: >1.00E+4nM. Assay description: Inhibition of CYP2A6 in human liver microsomes using coumarin as substrate preincubated for 5 mins followed by NADPH generating system addition and m...
Ligand InfoPC cidPC sid
In DepthDetails ArticlePubMed
TargetCytochrome P450 1A2(Homo sapiens (Human))
Shenyang Pharmaceutical University
Curated by ChEMBL
LigandPNGBDBM50549522(CHEMBL4786038)
Affinity DataIC50: >1.00E+4nM. Assay description: Inhibition of CYP1A2 in human liver microsomes using phenacetin as substrate preincubated for 5 mins followed by NADPH generating system addition and...
Ligand InfoPC cidPC sid
In DepthDetails ArticlePubMed
TargetCytochrome P450 2C19(Homo sapiens (Human))
Shenyang Pharmaceutical University
Curated by ChEMBL
LigandPNGBDBM50549522(CHEMBL4786038)
Affinity DataIC50: >1.00E+4nM. Assay description: Inhibition of CYP2C19 in human liver microsomes using S-mephenytoin as substrate preincubated for 5 mins followed by NADPH generating system addition...
Ligand InfoPC cidPC sid
In DepthDetails ArticlePubMed