BDBM50549846 CHEMBL4764646
SMILES Cc1nc(NC(=O)NCCOCC2CC2)sc1C#Cc1ccc2cncn2c1
InChI Key InChIKey=HSBRXTBEKJPMLK-UHFFFAOYSA-N
Data  15 KI  3 IC50
  Tab Delimited (TSV)   2D SDfile   Computed 3D by Vconf -m prep SDfile
Find this compound or compounds like it in BindingDB:
Activity Spreadsheet -- Enzyme Inhibition Constant Data from BindingDB
Found 18 hits for monomerid = 50549846
TargetPhosphatidylinositol 4,5-bisphosphate 3-kinase catalytic subunit gamma isoform(Homo sapiens (Human))
Vertex Pharmaceuticals
Curated by ChEMBL
LigandPNGBDBM50549846(CHEMBL4764646)
Affinity DataKi:  22nM. Assay description: Inhibition of PI3Kgamma (unknown origin) using PIP2 as substrate measured after 15 mins in presence of [33P]-ATP by liquid scintillation counting met...
Ligand InfoPC cidPC sid
In DepthDetails ArticlePubMed
TargetInterleukin-1 receptor-associated kinase 4(Homo sapiens (Human))
Vertex Pharmaceuticals
Curated by ChEMBL
LigandPNGBDBM50549846(CHEMBL4764646)
Affinity DataKi: >4.00E+3nM. Assay description: Inhibition of IRAK4 (unknown origin)
Ligand InfoPC cidPC sid
In DepthDetails ArticlePubMed
TargetProto-oncogene tyrosine-protein kinase Src(Homo sapiens (Human))
Vertex Pharmaceuticals
Curated by ChEMBL
LigandPNGBDBM50549846(CHEMBL4764646)
Affinity DataKi: >4.00E+3nM. Assay description: Inhibition of SRC (unknown origin)
Ligand InfoPC cidPC sid
In DepthDetails ArticlePubMed
TargetRho-associated protein kinase 1(Homo sapiens (Human))
Vertex Pharmaceuticals
Curated by ChEMBL
LigandPNGBDBM50549846(CHEMBL4764646)
Affinity DataKi: >4.00E+3nM. Assay description: Inhibition of ROCK1 (unknown origin)
Ligand InfoPC cidPC sid
In DepthDetails ArticlePubMed
TargetSerine/threonine-protein kinase PLK1(Homo sapiens (Human))
Vertex Pharmaceuticals
Curated by ChEMBL
LigandPNGBDBM50549846(CHEMBL4764646)
Affinity DataKi: >4.00E+3nM. Assay description: Inhibition of PLK1 (unknown origin)
Ligand InfoPC cidPC sid
In DepthDetails ArticlePubMed
TargetCyclin-dependent kinase 2(Homo sapiens (Human))
Vertex Pharmaceuticals
Curated by ChEMBL
LigandPNGBDBM50549846(CHEMBL4764646)
Affinity DataKi: >4.00E+3nM. Assay description: Inhibition of CDK2 (unknown origin)
Ligand InfoPC cidPC sid
In DepthDetails ArticlePubMed
TargetReceptor-type tyrosine-protein kinase FLT3(Homo sapiens (Human))
Vertex Pharmaceuticals
Curated by ChEMBL
LigandPNGBDBM50549846(CHEMBL4764646)
Affinity DataKi: >4.00E+3nM. Assay description: Inhibition of FLT3 (unknown origin)
Ligand InfoPC cidPC sid
In DepthDetails ArticlePubMed
TargetGlycogen synthase kinase-3 beta(Homo sapiens (Human))
Vertex Pharmaceuticals
Curated by ChEMBL
LigandPNGBDBM50549846(CHEMBL4764646)
Affinity DataKi: >4.00E+3nM. Assay description: Inhibition of GSK3B (unknown origin)
Ligand InfoPC cidPC sid
In DepthDetails ArticlePubMed
TargetTyrosine-protein kinase SYK(Homo sapiens (Human))
Vertex Pharmaceuticals
Curated by ChEMBL
LigandPNGBDBM50549846(CHEMBL4764646)
Affinity DataKi: >4.00E+3nM. Assay description: Inhibition of SYK (unknown origin)
Ligand InfoPC cidPC sid
In DepthDetails ArticlePubMed
TargetTyrosine-protein kinase JAK2(Homo sapiens (Human))
Vertex Pharmaceuticals
Curated by ChEMBL
LigandPNGBDBM50549846(CHEMBL4764646)
Affinity DataKi: >4.00E+3nM. Assay description: Inhibition of JAK2 (unknown origin)
Ligand InfoPC cidPC sid
In DepthDetails ArticlePubMed
TargetMitogen-activated protein kinase 10(Homo sapiens (Human))
Vertex Pharmaceuticals
Curated by ChEMBL
LigandPNGBDBM50549846(CHEMBL4764646)
Affinity DataKi: >4.00E+3nM. Assay description: Inhibition of JNK3 (unknown origin)
Ligand InfoPC cidPC sid
In DepthDetails ArticlePubMed
TargetVascular endothelial growth factor receptor 2(Homo sapiens (Human))
Vertex Pharmaceuticals
Curated by ChEMBL
LigandPNGBDBM50549846(CHEMBL4764646)
Affinity DataKi: >4.00E+3nM. Assay description: Inhibition of KDR (unknown origin)
Ligand InfoPC cidPC sid
In DepthDetails ArticlePubMed
TargetHepatocyte growth factor receptor(Homo sapiens (Human))
Vertex Pharmaceuticals
Curated by ChEMBL
LigandPNGBDBM50549846(CHEMBL4764646)
Affinity DataKi: >4.00E+3nM. Assay description: Inhibition of MET (unknown origin)
Ligand InfoPC cidPC sid
In DepthDetails ArticlePubMed
TargetcAMP-dependent protein kinase catalytic subunit alpha(Homo sapiens (Human))
Vertex Pharmaceuticals
Curated by ChEMBL
LigandPNGBDBM50549846(CHEMBL4764646)
Affinity DataKi: >4.00E+3nM. Assay description: Inhibition of PKA (unknown origin)
Ligand InfoPC cidPC sid
In DepthDetails ArticlePubMed
TargetDNA-dependent protein kinase catalytic subunit(Homo sapiens (Human))
Vertex Pharmaceuticals
Curated by ChEMBL
LigandPNGBDBM50549846(CHEMBL4764646)
Affinity DataKi: >7.00E+3nM. Assay description: Inhibition of DNA-PK (unknown origin)
Ligand InfoPC cidPC sid
In DepthDetails ArticlePubMed
TargetPotassium voltage-gated channel subfamily H member 2(Homo sapiens (Human))
Vertex Pharmaceuticals
Curated by ChEMBL
LigandPNGBDBM50549846(CHEMBL4764646)
Affinity DataIC50: >3.00E+4nM. Assay description: Inhibition of human ERG by planar patch clamp method
Ligand InfoPC cidPC sid
In DepthDetails ArticlePubMed
TargetCytochrome P450 2C9(Homo sapiens (Human))
Vertex Pharmaceuticals
Curated by ChEMBL
LigandPNGBDBM50549846(CHEMBL4764646)
Affinity DataIC50:  1.10E+4nM. Assay description: Inhibition of CYP2C9 (unknown origin)
Ligand InfoPC cidPC sid
In DepthDetails ArticlePubMed
TargetPhosphatidylinositol 4,5-bisphosphate 3-kinase catalytic subunit gamma isoform(Homo sapiens (Human))
Vertex Pharmaceuticals
Curated by ChEMBL
LigandPNGBDBM50549846(CHEMBL4764646)
Affinity DataIC50:  600nM. Assay description: Inhibition of PI3Kgamma in human THP-1 cells assessed as reduction in Akt phosphorylation at Ser473 residue
Ligand InfoPC cidPC sid
In DepthDetails ArticlePubMed