BDBM50553207 CHEMBL4786783
SMILES NC(=O)Cc1cccc(Nc2nc(C#C)c3nc[nH]c3n2)c1
InChI Key InChIKey=CJQGLUJHMXCLQY-UHFFFAOYSA-N
Data  12 IC50
  Tab Delimited (TSV)   2D SDfile   Computed 3D by Vconf -m prep SDfile
Find this compound or compounds like it in BindingDB:
Activity Spreadsheet -- Enzyme Inhibition Constant Data from BindingDB
Found 12 hits for monomerid = 50553207
TargetSerine/threonine-protein kinase Nek2(Homo sapiens (Human))
Newcastle University
Curated by ChEMBL
LigandPNGBDBM50553207(CHEMBL4786783)
Affinity DataIC50:  62nM. Assay description: Inhibition of human recombinant full length His-tagged NEK2 expressed in baculovirus expression system assessed as inhibition of substrate phosphoryl...
In DepthDetails ArticlePubMed
TargetCytoplasmic tyrosine-protein kinase BMX(Homo sapiens (Human))
Newcastle University
Curated by ChEMBL
LigandPNGBDBM50553207(CHEMBL4786783)
Affinity DataIC50:  830nM. Assay description: Inhibition of BMX (unknown origin) preincubated with enzyme for 15 mins followed by substrate/ATP challenge for 90 mins by ProfilerPro plate based la...
In DepthDetails ArticlePubMed
TargetAurora kinase A(Homo sapiens (Human))
Newcastle University
Curated by ChEMBL
LigandPNGBDBM50553207(CHEMBL4786783)
Affinity DataIC50:  80nM. Assay description: Inhibition of Aurora A (unknown origin) preincubated with enzyme for 15 mins followed by substrate/ATP challenge for 90 mins by ProfilerPro plate bas...
In DepthDetails ArticlePubMed
TargetSerine/threonine-protein kinase Nek2(Homo sapiens (Human))
Newcastle University
Curated by ChEMBL
LigandPNGBDBM50553207(CHEMBL4786783)
Affinity DataIC50:  18nM. Assay description: Inhibition of human NEK2 by kinase-profiling analysis
In DepthDetails ArticlePubMed
TargetDual specificity mitogen-activated protein kinase kinase 1(Homo sapiens (Human))
Newcastle University
Curated by ChEMBL
LigandPNGBDBM50553207(CHEMBL4786783)
Affinity DataIC50:  550nM. Assay description: Inhibition of human MKK1 by kinase-profiling analysis
In DepthDetails ArticlePubMed
TargetSerine/threonine-protein kinase Chk1(Homo sapiens (Human))
Newcastle University
Curated by ChEMBL
LigandPNGBDBM50553207(CHEMBL4786783)
Affinity DataIC50:  560nM. Assay description: Inhibition of human ChK1 by kinase-profiling analysis
In DepthDetails ArticlePubMed
TargetMitogen-activated protein kinase kinase kinase 11(Homo sapiens (Human))
Newcastle University
Curated by ChEMBL
LigandPNGBDBM50553207(CHEMBL4786783)
Affinity DataIC50:  320nM. Assay description: Inhibition of human MLK3 by kinase-profiling analysis
In DepthDetails ArticlePubMed
TargetNUAK family SNF1-like kinase 1(Homo sapiens (Human))
Newcastle University
Curated by ChEMBL
LigandPNGBDBM50553207(CHEMBL4786783)
Affinity DataIC50:  120nM. Assay description: Inhibition of human NAUK1 by kinase-profiling analysis
In DepthDetails ArticlePubMed
TargetSerine/threonine-protein kinase TBK1(Homo sapiens (Human))
Newcastle University
Curated by ChEMBL
LigandPNGBDBM50553207(CHEMBL4786783)
Affinity DataIC50:  740nM. Assay description: Inhibition of human TBK1 by kinase-profiling analysis
In DepthDetails ArticlePubMed
TargetMitogen-activated protein kinase kinase kinase 7(Homo sapiens (Human))
Newcastle University
Curated by ChEMBL
LigandPNGBDBM50553207(CHEMBL4786783)
Affinity DataIC50:  240nM. Assay description: Inhibition of human TAK1 by kinase-profiling analysis
In DepthDetails ArticlePubMed
TargetTyrosine-protein kinase JAK2(Homo sapiens (Human))
Newcastle University
Curated by ChEMBL
LigandPNGBDBM50553207(CHEMBL4786783)
Affinity DataIC50:  220nM. Assay description: Inhibition of human JAK2 by kinase-profiling analysis
In DepthDetails ArticlePubMed
TargetMitogen-activated protein kinase kinase kinase 9(Homo sapiens (Human))
Newcastle University
Curated by ChEMBL
LigandPNGBDBM50553207(CHEMBL4786783)
Affinity DataIC50:  270nM. Assay description: Inhibition of human MLK1 by kinase-profiling analysis
In DepthDetails ArticlePubMed