BDBM50553310 CHEMBL4792908
SMILES CCCC[C@@H]1NC(=O)[C@H](CO)NC(=O)[C@H](CSCC(=O)NCCC[C@@H](NC(=O)CSC[C@H](NC(=O)[C@@H](NC(=O)[C@H](CCCNC(N)=N)NC(=O)[C@@H](NC(=O)[C@H](CCC(O)=O)NC1=O)[C@@H](C)O)[C@@H](C)O)C(=O)N[C@@H](CC(O)=O)C(=O)N[C@@H]([C@@H](C)CC)C(=O)N[C@@H](CC(N)=O)C(=O)N1CCC[C@H]1C(=O)N[C@@H](C)C(=O)N[C@@H](Cc1c[nH]c2ccccc12)C(=O)N[C@@H](Cc1ccc(O)cc1)C(=O)N[C@@H]([C@@H](C)O)C(=O)NCC(=O)N[C@@H](CCCCNC(N)=N)C(=O)NCC(=O)N[C@@H]([C@@H](C)CC)C(=O)N[C@@H](CCCNC(N)=N)C(=O)N1CCC[C@H]1C(=O)N[C@@H](C(C)C)C(=O)NCC(=O)N[C@@H](CCCNC(N)=N)C(=O)N[C@@H](Cc1ccccc1)C(N)=O)C(=O)NCCOCCOCCC(=O)NCCOCCOCCC(=O)NCCCC[C@H](NC(=O)CCCCCCCCCCCCCCCCC(O)=O)C(O)=O)NC(=O)[C@H](CCC(N)=O)NC(=O)[C@H](Cc1cnc[nH]1)NC(=O)[C@H](C)NC(=O)[C@H](CCCNC(N)=N)NC(=O)[C@@H](N)CO
InChI Key InChIKey=IAKOWOFORBBMRO-CGPQYYKRSA-N
Data  4 EC50
  Tab Delimited (TSV)   2D SDfile   Computed 3D by Vconf -m prep SDfile
Find this compound or compounds like it in BindingDB:
Activity Spreadsheet -- Enzyme Inhibition Constant Data from BindingDB
Found 4 hits for monomerid = 50553310
TargetProlactin-releasing peptide receptor(Homo sapiens (Human))
Calibr At Scripps Research
Curated by ChEMBL
LigandPNGBDBM50553310(CHEMBL4792908)
Affinity DataEC50:  80nM. Assay description: Activation of human GPR10 overexpressed in CHO-K1 cells assessed as increase in beta arrestin recruitment incubated for 90 mins in presence of 10% FB...
Ligand InfoPC cidPC sid
In DepthDetails ArticlePubMed
TargetProlactin-releasing peptide receptor(Homo sapiens (Human))
Calibr At Scripps Research
Curated by ChEMBL
LigandPNGBDBM50553310(CHEMBL4792908)
Affinity DataEC50:  7.80nM. Assay description: Activation of human GPR10 overexpressed in CHO-K1 cells assessed as increase in beta arrestin recruitment incubated for 90 mins by PathHunter assay
Ligand InfoPC cidPC sid
In DepthDetails ArticlePubMed
TargetNeuropeptide FF receptor 2(Homo sapiens (Human))
Calibr At Scripps Research
Curated by ChEMBL
LigandPNGBDBM50553310(CHEMBL4792908)
Affinity DataEC50:  520nM. Assay description: Activation of human NPFF2R overexpressing CHO cells assessed as inhibition of forskolin-stimulated cAMP degradation incubated for 30 mins in presence...
Ligand InfoPC cidPC sid
In DepthDetails ArticlePubMed
TargetNeuropeptide FF receptor 2(Homo sapiens (Human))
Calibr At Scripps Research
Curated by ChEMBL
LigandPNGBDBM50553310(CHEMBL4792908)
Affinity DataEC50: >1.00E+4nM. Assay description: Activation of human NPFF2R overexpressing CHO cells assessed as inhibition of forskolin-stimulated cAMP degradation incubated for 30 mins in presence...
Ligand InfoPC cidPC sid
In DepthDetails ArticlePubMed