BDBM50553318 CHEMBL4757457
SMILES CC[C@H](C)[C@H](NC(=O)CNC(=O)[C@H](CCCNC(N)=N)NC(=O)CNC(=O)[C@@H]1CSSC[C@H](NC(=O)[C@@H]2CCCN2C(=O)[C@@H](N)[C@H](C)O)C(=O)N[C@@H]([C@@H](C)CC)C(=O)N[C@@H](CC(N)=O)C(=O)N2CCC[C@H]2C(=O)N[C@@H](C)C(=O)N[C@@H](Cc2c[nH]c3ccccc23)C(=O)N[C@@H](Cc2ccc(O)cc2)C(=O)N1)C(=O)N[C@@H](CCCNC(N)=N)C(=O)N1CCC[C@H]1C(=O)N[C@@H](C(C)C)C(=O)NCC(=O)N[C@@H](CCCNC(N)=N)C(=O)N[C@@H](Cc1ccccc1)C(N)=O
InChI Key InChIKey=JZDXGDIYKDOSQY-DZKVJBEISA-N
Data  1 EC50
  Tab Delimited (TSV)   2D SDfile   Computed 3D by Vconf -m prep SDfile
Find this compound or compounds like it in BindingDB:
Activity Spreadsheet -- Enzyme Inhibition Constant Data from BindingDB
Found 1 hit for monomerid = 50553318
TargetProlactin-releasing peptide receptor(Homo sapiens (Human))
Calibr At Scripps Research
Curated by ChEMBL
LigandPNGBDBM50553318(CHEMBL4757457)
Affinity DataEC50:  16nM. Assay description: Activation of human GPR10 overexpressed in CHO-K1 cells assessed as increase in beta arrestin recruitment incubated for 90 mins by PathHunter assay
Ligand InfoPC cidPC sid
In DepthDetails ArticlePubMed