BDBM50553355 CHEMBL4784824
SMILES CC[C@H](C)[C@H](NC(=O)[C@H](CC(O)=O)NC(=O)[C@@H]1CCCN1C(=O)[C@@H](N)[C@@H](C)O)C(=O)N[C@@H](CC(N)=O)C(=O)N1CCC[C@H]1C(=O)N[C@H]1CSCC(=O)NCCCCNC(=O)CSC[C@H](NC(=O)CNC(=O)[C@H](CCCNC(N)=N)NC(=O)CNC(=O)[C@@H](NC(=O)[C@H](Cc2ccc(O)cc2)NC(=O)[C@H](Cc2c[nH]c3ccccc23)NC1=O)[C@@H](C)O)C(=O)N[C@@H](CCCNC(N)=N)C(=O)N1CCC[C@H]1C(=O)N[C@@H](C(C)C)C(=O)NCC(=O)N[C@@H](CCCNC(N)=N)C(=O)N[C@@H](Cc1ccccc1)C(N)=O
InChI Key InChIKey=KWLQKDAEFVHJIG-VCEWNIJHSA-N
Data  1 EC50
  Tab Delimited (TSV)   2D SDfile   Computed 3D by Vconf -m prep SDfile
Find this compound or compounds like it in BindingDB:
Activity Spreadsheet -- Enzyme Inhibition Constant Data from BindingDB
Found 1 hit for monomerid = 50553355
TargetProlactin-releasing peptide receptor(Homo sapiens (Human))
Calibr At Scripps Research
Curated by ChEMBL
LigandPNGBDBM50553355(CHEMBL4784824)
Affinity DataEC50:  10nM. Assay description: Activation of human GPR10 overexpressed in CHO-K1 cells assessed as increase in beta arrestin recruitment incubated for 90 mins by PathHunter assay
Ligand InfoPC cidPC sid
In DepthDetails ArticlePubMed