BDBM50553367 CHEMBL4740251
SMILES CCCCCCCCCCCCCC(=O)NCCOCCOCCNC(=O)CCOCCOCCNC(=O)[C@H]1CCCNC(=O)CSC[C@H](NC(=O)[C@H](CCC(N)=O)NC(=O)[C@H](Cc2cnc[nH]2)NC(=O)[C@H](C)NC(=O)[C@H](CCCNC(N)=N)NC(=O)[C@@H](N)CO)C(=O)N[C@@H](CO)C(=O)N[C@@H](CCSC)C(=O)N[C@@H](CCC(O)=O)C(=O)N[C@@H]([C@@H](C)O)C(=O)N[C@@H](CCCNC(N)=N)C(=O)N[C@@H]([C@@H](C)O)C(=O)N[C@@H](CSCC(=O)N1)C(=O)N[C@@H](CC(O)=O)C(=O)N[C@@H]([C@@H](C)CC)C(=O)N[C@@H](CC(N)=O)C(=O)N1CCC[C@H]1C(=O)N[C@@H](C)C(=O)N[C@@H](Cc1c[nH]c2ccccc12)C(=O)N[C@@H](Cc1ccc(O)cc1)C(=O)N[C@@H]([C@@H](C)O)C(=O)NCC(=O)N[C@@H](CCCNC(N)=N)C(=O)NCC(=O)N[C@@H]([C@@H](C)CC)C(=O)N[C@@H](CCCNC(N)=N)C(=O)N1CCC[C@H]1C(=O)N[C@@H](C(C)C)C(=O)NCC(=O)N[C@@H](CCCNC(N)=N)C(=O)N[C@@H](Cc1ccccc1)C(N)=O
InChI Key InChIKey=GHWGSGOMHRTQAC-UPBXRCQVSA-N
Data  1 EC50
  Tab Delimited (TSV)   2D SDfile   Computed 3D by Vconf -m prep SDfile
Find this compound or compounds like it in BindingDB:
Activity Spreadsheet -- Enzyme Inhibition Constant Data from BindingDB
Found 1 hit for monomerid = 50553367
TargetProlactin-releasing peptide receptor(Homo sapiens (Human))
Calibr At Scripps Research
Curated by ChEMBL
LigandPNGBDBM50553367(CHEMBL4740251)
Affinity DataEC50:  13nM. Assay description: Activation of human GPR10 overexpressed in CHO-K1 cells assessed as increase in beta arrestin recruitment incubated for 90 mins by PathHunter assay
Ligand InfoPC cidPC sid
In DepthDetails ArticlePubMed