BDBM50553380 CHEMBL4746732
SMILES CCCCCCCCCCCCCC(=O)NCCOCCOCCNC(=O)CCOCCOCCNC(=O)[C@H]1CCCNC(=O)CSC[C@H](NC(=O)[C@@H](NC(=O)[C@H](CC(O)=O)NC(=O)[C@@H]2CCCN2C(=O)[C@@H](NC(=O)[C@H](CCCNC(N)=N)NC(=O)[C@@H](NC(=O)[C@H](CCC(O)=O)NC(=O)[C@H](CCSC)NC(=O)[C@H](CO)NC(=O)[C@H](Cc2cnc[nH]2)NC(=O)[C@H](CCC(N)=O)NC(=O)[C@H](Cc2cnc[nH]2)NC(=O)[C@H](C)NC(=O)[C@H](CCCNC(N)=N)NC(=O)[C@@H](N)CO)[C@@H](C)O)[C@@H](C)O)[C@@H](C)CC)C(=O)N2CCC[C@H]2C(=O)N[C@@H](C)C(=O)N[C@@H](Cc2c[nH]c3ccccc23)C(=O)N[C@@H](Cc2ccc(O)cc2)C(=O)N[C@@H]([C@@H](C)O)C(=O)NCC(=O)N[C@@H](CSCC(=O)N1)C(=O)NCC(=O)N[C@@H]([C@@H](C)CC)C(=O)N[C@@H](CCCNC(N)=N)C(=O)N1CCC[C@H]1C(=O)N[C@@H](C(C)C)C(=O)NCC(=O)N[C@@H](CCCNC(N)=N)C(=O)N[C@@H](Cc1ccccc1)C(N)=O
InChI Key InChIKey=WILDOTSYPMZBDI-DHSNHCEASA-N
Data  1 EC50
  Tab Delimited (TSV)   2D SDfile   Computed 3D by Vconf -m prep SDfile
Find this compound or compounds like it in BindingDB:
Activity Spreadsheet -- Enzyme Inhibition Constant Data from BindingDB
Found 1 hit for monomerid = 50553380
TargetProlactin-releasing peptide receptor(Homo sapiens (Human))
Calibr At Scripps Research
Curated by ChEMBL
LigandPNGBDBM50553380(CHEMBL4746732)
Affinity DataEC50:  23nM. Assay description: Activation of human GPR10 overexpressed in CHO-K1 cells assessed as increase in beta arrestin recruitment incubated for 90 mins by PathHunter assay
Ligand InfoPC cidPC sid
In DepthDetails ArticlePubMed