BDBM50554195 CHEMBL4798676
SMILES CNc1cc(F)cc2cc(C(=O)Nc3ccc(cc3)C(=O)NCCN3CCOCC3)c(=O)[nH]c12
InChI Key InChIKey=UMTBCDLZQQIIBT-UHFFFAOYSA-N
Data  1 IC50
  Tab Delimited (TSV)   2D SDfile   Computed 3D by Vconf -m prep SDfile
Find this compound or compounds like it in BindingDB:
Activity Spreadsheet -- Enzyme Inhibition Constant Data from BindingDB
Found 1 hit for monomerid = 50554195
TargetDNA gyrase subunit A/B(Escherichia coli (strain K12))
Taisho Pharmaceutical
Curated by ChEMBL
LigandPNGBDBM50554195(CHEMBL4798676)
Affinity DataIC50:  7.30nM. Assay description: Inhibition of Escherichia coli DNA gyrase by measuring supercoiling activity incubated for 60 mins by fluorescence based assay
Ligand InfoPC cidPC sid
In DepthDetails ArticlePubMed