BDBM50554223 CHEMBL4741723
SMILES OC=O.CNc1cc(F)cc2c(NCC3CCNCC3)c(C(=O)Nc3ccc(cc3)C(O)=O)c(=O)[nH]c12
InChI Key InChIKey=YYRQKIWQVBMKIM-UHFFFAOYSA-N
Data  1 IC50
  Tab Delimited (TSV)   2D SDfile   Computed 3D by Vconf -m prep SDfile
Find this compound or compounds like it in BindingDB:
Activity Spreadsheet -- Enzyme Inhibition Constant Data from BindingDB
Found 1 hit for monomerid = 50554223
TargetDNA gyrase subunit A/B(Escherichia coli (strain K12))
Taisho Pharmaceutical
Curated by ChEMBL
LigandPNGBDBM50554223(CHEMBL4741723)
Affinity DataIC50:  1.30nM. Assay description: Inhibition of Escherichia coli DNA gyrase by measuring supercoiling activity incubated for 60 mins by fluorescence based assay
Ligand InfoPC cidPC sid
In DepthDetails ArticlePubMed