BDBM50556798 CHEMBL4742096
SMILES Clc1ccc(cc1)-c1coc(=O)n1C(=O)NCCCCc1ccccc1
InChI Key InChIKey=UFYSJVJBQMFSIR-UHFFFAOYSA-N
Data  1 IC50
  Tab Delimited (TSV)   2D SDfile   Computed 3D by Vconf -m prep SDfile
Find this compound or compounds like it in BindingDB:
Activity Spreadsheet -- Enzyme Inhibition Constant Data from BindingDB
Found 1 hit for monomerid = 50556798
TargetAcid ceramidase(Homo sapiens (Human))
Fondazione Istituto Italiano Di Tecnologia
Curated by ChEMBL
LigandPNGBDBM50556798(CHEMBL4742096)
Affinity DataIC50:  5nM. Assay description: Inhibition of human acid ceramidase using N-lauroyl ceramide incubated for 1 hr by LC/MS analysis
Ligand InfoPC cidPC sid
In DepthDetails ArticlePubMed