BDBM50557936 CHEMBL4748004
SMILES OC(=O)C(F)(F)F.OC(=O)C(F)(F)F.OC(=O)C(F)(F)F.[O-]C(=O)C(F)(F)F.Cc1cc(\C=C\c2cc3CCCN4CCCc(c2)c34)cc(C)[n+]1CCN1CCN(CCCCC2CCN(CC(=O)N3c4ccccc4NC(=O)c4ccccc34)CC2)CC1
InChI Key InChIKey=MYFOSGGTPUMZLP-UHFFFAOYSA-N
Data  5 KI  2 Kd
  Tab Delimited (TSV)   2D SDfile   Computed 3D by Vconf -m prep SDfile
Find this compound or compounds like it in BindingDB:
Activity Spreadsheet -- Enzyme Inhibition Constant Data from BindingDB
Found 7 hits for monomerid = 50557936
TargetMuscarinic acetylcholine receptor M1(Homo sapiens (Human))
University Of Regensburg
Curated by ChEMBL
LigandPNGBDBM50557936(CHEMBL4748004)
Affinity DataKi:  0.955nM. Assay description: Displacement of [3H]NMS from human recombinant muscarinic receptor M2 expressed in CHO-K9 cell membranes measured after 3 hrs by radioligand competit...
Ligand InfoPC cidPC sid
In DepthDetails ArticlePubMed
TargetMuscarinic acetylcholine receptor M4(Homo sapiens (Human))
University Of Regensburg
Curated by ChEMBL
LigandPNGBDBM50557936(CHEMBL4748004)
Affinity DataKi:  2.70nM. Assay description: Displacement of [3H]NMS from human recombinant muscarinic receptor M4 expressed in CHO-K9 cell membranes measured after 3 hrs by radioligand competit...
Ligand InfoPC cidPC sid
In DepthDetails ArticlePubMed
TargetMuscarinic acetylcholine receptor M1(Homo sapiens (Human))
University Of Regensburg
Curated by ChEMBL
LigandPNGBDBM50557936(CHEMBL4748004)
Affinity DataKi:  4.80nM. Assay description: Displacement of [3H]NMS from human recombinant muscarinic receptor M1 expressed in CHO-K9 cell membranes measured after 3 hrs by radioligand competit...
Ligand InfoPC cidPC sid
In DepthDetails ArticlePubMed
TargetMuscarinic acetylcholine receptor M3(Homo sapiens (Human))
University Of Regensburg
Curated by ChEMBL
LigandPNGBDBM50557936(CHEMBL4748004)
Affinity DataKi:  63nM. Assay description: Displacement of [3H]NMS from human recombinant muscarinic receptor M3 expressed in CHO-K9 cell membranes measured after 3 hrs by radioligand competit...
Ligand InfoPC cidPC sid
In DepthDetails ArticlePubMed
TargetMuscarinic acetylcholine receptor M5(Homo sapiens (Human))
University Of Regensburg
Curated by ChEMBL
LigandPNGBDBM50557936(CHEMBL4748004)
Affinity DataKi:  126nM. Assay description: Displacement of [3H]NMS from human recombinant muscarinic receptor M5 expressed in CHO-K1 cell membranes measured after 3 hrs by radioligand competit...
Ligand InfoPC cidPC sid
In DepthDetails ArticlePubMed
TargetMuscarinic acetylcholine receptor M2(Homo sapiens (Human))
University Of Regensburg
Curated by ChEMBL
LigandPNGBDBM50557936(CHEMBL4748004)
Affinity DataKd:  1.90nM. Assay description: Binding affinity to human muscarinic M2 receptor expressed in CHO-K9 cells assessed as unspecific binding at Kd incubated in dark at 22 degree C for ...
Ligand InfoPC cidPC sid
In DepthDetails ArticlePubMed
TargetMuscarinic acetylcholine receptor M2(Homo sapiens (Human))
University Of Regensburg
Curated by ChEMBL
LigandPNGBDBM50557936(CHEMBL4748004)
Affinity DataKd:  1.90nM. Assay description: Binding affinity to human muscarinic M2 receptor expressed in CHO-K9 cells assessed as unspecific binding at Kd incubated in dark at 22 degree C for ...
Ligand InfoPC cidPC sid
In DepthDetails ArticlePubMed