BDBM50557938 CHEMBL4744233
SMILES OC(=O)C(F)(F)F.OC(=O)C(F)(F)F.[O-]C(=O)C(F)(F)F.Cc1cc(\C=C\c2cc3CCCN4CCCc(c2)c34)cc(C)[n+]1CCNC(=O)CCc1cn(CCCCC2CCN(CC(=O)N3c4ccccc4NC(=O)c4ccccc34)CC2)cn1
InChI Key InChIKey=QVWPBMMSMXDEAC-UHFFFAOYSA-N
Data  5 KI  2 Kd
  Tab Delimited (TSV)   2D SDfile   Computed 3D by Vconf -m prep SDfile
Find this compound or compounds like it in BindingDB:
Activity Spreadsheet -- Enzyme Inhibition Constant Data from BindingDB
Found 7 hits for monomerid = 50557938
TargetMuscarinic acetylcholine receptor M1(Homo sapiens (Human))
University Of Regensburg
Curated by ChEMBL
LigandPNGBDBM50557938(CHEMBL4744233)
Affinity DataKi:  1.30nM. Assay description: Displacement of [3H]NMS from human recombinant muscarinic receptor M2 expressed in CHO-K9 cell membranes measured after 3 hrs by radioligand competit...
Ligand InfoPC cidPC sid
In DepthDetails ArticlePubMed
TargetMuscarinic acetylcholine receptor M4(Homo sapiens (Human))
University Of Regensburg
Curated by ChEMBL
LigandPNGBDBM50557938(CHEMBL4744233)
Affinity DataKi:  2.60nM. Assay description: Displacement of [3H]NMS from human recombinant muscarinic receptor M4 expressed in CHO-K9 cell membranes measured after 3 hrs by radioligand competit...
Ligand InfoPC cidPC sid
In DepthDetails ArticlePubMed
TargetMuscarinic acetylcholine receptor M1(Homo sapiens (Human))
University Of Regensburg
Curated by ChEMBL
LigandPNGBDBM50557938(CHEMBL4744233)
Affinity DataKi:  7.10nM. Assay description: Displacement of [3H]NMS from human recombinant muscarinic receptor M1 expressed in CHO-K9 cell membranes measured after 3 hrs by radioligand competit...
Ligand InfoPC cidPC sid
In DepthDetails ArticlePubMed
TargetMuscarinic acetylcholine receptor M5(Homo sapiens (Human))
University Of Regensburg
Curated by ChEMBL
LigandPNGBDBM50557938(CHEMBL4744233)
Affinity DataKi:  41nM. Assay description: Displacement of [3H]NMS from human recombinant muscarinic receptor M5 expressed in CHO-K1 cell membranes measured after 3 hrs by radioligand competit...
Ligand InfoPC cidPC sid
In DepthDetails ArticlePubMed
TargetMuscarinic acetylcholine receptor M3(Homo sapiens (Human))
University Of Regensburg
Curated by ChEMBL
LigandPNGBDBM50557938(CHEMBL4744233)
Affinity DataKi:  69nM. Assay description: Displacement of [3H]NMS from human recombinant muscarinic receptor M3 expressed in CHO-K9 cell membranes measured after 3 hrs by radioligand competit...
Ligand InfoPC cidPC sid
In DepthDetails ArticlePubMed
TargetMuscarinic acetylcholine receptor M2(Homo sapiens (Human))
University Of Regensburg
Curated by ChEMBL
LigandPNGBDBM50557938(CHEMBL4744233)
Affinity DataKd:  3.80nM. Assay description: Binding affinity to human muscarinic M2 receptor expressed in CHO-K9 cells assessed as unspecific binding at Kd incubated in dark at 22 degree C for ...
Ligand InfoPC cidPC sid
In DepthDetails ArticlePubMed
TargetMuscarinic acetylcholine receptor M2(Homo sapiens (Human))
University Of Regensburg
Curated by ChEMBL
LigandPNGBDBM50557938(CHEMBL4744233)
Affinity DataKd:  3.80nM. Assay description: Binding affinity to human muscarinic M2 receptor expressed in CHO-K9 cells assessed as unspecific binding at Kd incubated in dark at 22 degree C for ...
Ligand InfoPC cidPC sid
In DepthDetails ArticlePubMed