BDBM50557940 CHEMBL4789147
SMILES OC(=O)C(F)(F)F.OC(=O)C(F)(F)F.CN(C)c1ccc2c(-c3ccc(cc3C([O-])=O)C(=O)NCCNC(=O)CCc3cn(CCCCC4CCN(CC(=O)N5c6ccccc6NC(=O)c6ccccc56)CC4)cn3)c3ccc(cc3oc2c1)=[N+](C)C
InChI Key InChIKey=OTWPYWJMLIDHOJ-UHFFFAOYSA-N
Data  5 KI  2 Kd
  Tab Delimited (TSV)   2D SDfile   Computed 3D by Vconf -m prep SDfile
Find this compound or compounds like it in BindingDB:
Activity Spreadsheet -- Enzyme Inhibition Constant Data from BindingDB
Found 7 hits for monomerid = 50557940
TargetMuscarinic acetylcholine receptor M1(Homo sapiens (Human))
University Of Regensburg
Curated by ChEMBL
LigandPNGBDBM50557940(CHEMBL4789147)
Affinity DataKi:  1.80nM. Assay description: Displacement of [3H]NMS from human recombinant muscarinic receptor M2 expressed in CHO-K9 cell membranes measured after 3 hrs by radioligand competit...
Ligand InfoPC cidPC sid
In DepthDetails ArticlePubMed
TargetMuscarinic acetylcholine receptor M4(Homo sapiens (Human))
University Of Regensburg
Curated by ChEMBL
LigandPNGBDBM50557940(CHEMBL4789147)
Affinity DataKi:  3.70nM. Assay description: Displacement of [3H]NMS from human recombinant muscarinic receptor M4 expressed in CHO-K9 cell membranes measured after 3 hrs by radioligand competit...
Ligand InfoPC cidPC sid
In DepthDetails ArticlePubMed
TargetMuscarinic acetylcholine receptor M1(Homo sapiens (Human))
University Of Regensburg
Curated by ChEMBL
LigandPNGBDBM50557940(CHEMBL4789147)
Affinity DataKi:  6.20nM. Assay description: Displacement of [3H]NMS from human recombinant muscarinic receptor M1 expressed in CHO-K9 cell membranes measured after 3 hrs by radioligand competit...
Ligand InfoPC cidPC sid
In DepthDetails ArticlePubMed
TargetMuscarinic acetylcholine receptor M3(Homo sapiens (Human))
University Of Regensburg
Curated by ChEMBL
LigandPNGBDBM50557940(CHEMBL4789147)
Affinity DataKi:  129nM. Assay description: Displacement of [3H]NMS from human recombinant muscarinic receptor M3 expressed in CHO-K9 cell membranes measured after 3 hrs by radioligand competit...
Ligand InfoPC cidPC sid
In DepthDetails ArticlePubMed
TargetMuscarinic acetylcholine receptor M5(Homo sapiens (Human))
University Of Regensburg
Curated by ChEMBL
LigandPNGBDBM50557940(CHEMBL4789147)
Affinity DataKi:  275nM. Assay description: Displacement of [3H]NMS from human recombinant muscarinic receptor M5 expressed in CHO-K1 cell membranes measured after 3 hrs by radioligand competit...
Ligand InfoPC cidPC sid
In DepthDetails ArticlePubMed
TargetMuscarinic acetylcholine receptor M2(Homo sapiens (Human))
University Of Regensburg
Curated by ChEMBL
LigandPNGBDBM50557940(CHEMBL4789147)
Affinity DataKd:  2.40nM. Assay description: Binding affinity to human muscarinic M2 receptor expressed in CHO-K9 cells assessed as unspecific binding at Kd incubated in dark at 22 degree C for ...
Ligand InfoPC cidPC sid
In DepthDetails ArticlePubMed
TargetMuscarinic acetylcholine receptor M2(Homo sapiens (Human))
University Of Regensburg
Curated by ChEMBL
LigandPNGBDBM50557940(CHEMBL4789147)
Affinity DataKd:  2.40nM. Assay description: Binding affinity to human muscarinic M2 receptor expressed in CHO-K9 cells assessed as unspecific binding at Kd incubated in dark at 22 degree C for ...
Ligand InfoPC cidPC sid
In DepthDetails ArticlePubMed