BDBM50563132 CHEMBL4795658
SMILES COc1ccc(N2CCOCC2)c2sc(NC(=O)N3CCC(COCCF)CC3)nc12
InChI Key InChIKey=LRWUOVFGKOZKOP-UHFFFAOYSA-N
Data  2 KI
  Tab Delimited (TSV)   2D SDfile   Computed 3D by Vconf -m prep SDfile
Find this compound or compounds like it in BindingDB:
Activity Spreadsheet -- Enzyme Inhibition Constant Data from BindingDB
Found 2 hits for monomerid = 50563132
TargetAdenosine receptor A2a(Homo sapiens (Human))
University Of Cologne
Curated by ChEMBL
LigandPNGBDBM50563132(CHEMBL4795658)
Affinity DataKi:  35nM. Assay description: Displacement of [3H]-ZM241385 from recombinant human A2A receptor expressed in CHO-K1 cells incubated for 70 mins by liquid scintillation counting me...
Ligand InfoPC cidPC sid
In DepthDetails ArticlePubMed
TargetAdenosine receptor A1(Homo sapiens (Human))
University Of Cologne
Curated by ChEMBL
LigandPNGBDBM50563132(CHEMBL4795658)
Affinity DataKi:  7.98E+3nM. Assay description: Displacement of [3H]-DPCPX from recombinant human A1 receptor expressed in CHO-K1 cells incubated for 70 mins by liquid scintillation counting method
Ligand InfoPC cidPC sid
In DepthDetails ArticlePubMed