BDBM50563321 CHEMBL4744174
SMILES Clc1cncc(-c2c[nH]c3ncccc23)c1N1CCC2(CCNC2=O)CC1
InChI Key InChIKey=DFXPOARIQXPDMN-UHFFFAOYSA-N
Data  1 KI
  Tab Delimited (TSV)   2D SDfile   Computed 3D by Vconf -m prep SDfile
Find this compound or compounds like it in BindingDB:
Activity Spreadsheet -- Enzyme Inhibition Constant Data from BindingDB
Found 1 hit for monomerid = 50563321
TargetCyclin-C(Homo sapiens (Human))
University Of South Australia
Curated by ChEMBL
LigandPNGBDBM50563321(CHEMBL4744174)
Affinity DataKi:  14nM. Assay description: Inhibition of CDK8/cyclin C (unknown origin) using RBER-IRStide as substrate incubated for 60 mins in presence of [gamma33P]ATP by scintillation coun...
Ligand InfoPC cidPC sid
In DepthDetails ArticlePubMed