BDBM50564977 CHEMBL4781705
SMILES COc1cc(NS(=O)(=O)C(C)C)cc(c1)-c1cc(cnc1N)-c1ccc(cc1)N1CCNCC1
InChI Key InChIKey=AGBKRFXLWIHJQH-UHFFFAOYSA-N
Data  3 IC50
  Tab Delimited (TSV)   2D SDfile   Computed 3D by Vconf -m prep SDfile
Find this compound or compounds like it in BindingDB:
Activity Spreadsheet -- Enzyme Inhibition Constant Data from BindingDB
Found 3 hits for monomerid = 50564977
TargetReceptor-interacting serine/threonine-protein kinase 2(Homo sapiens (Human))
University Of Houston
Curated by ChEMBL
LigandPNGBDBM50564977(CHEMBL4781705)
Affinity DataIC50:  13nM. Assay description: Inhibition of recombinant human RIPK2 incubated for 2 hr by ADP-Glo assay
Ligand InfoPC cidPC sid
In DepthDetails ArticlePubMed
TargetNucleotide-binding oligomerization domain-containing protein 2(Homo sapiens (Human))
University Of Houston
Curated by ChEMBL
LigandPNGBDBM50564977(CHEMBL4781705)
Affinity DataIC50:  121nM. Assay description: Inhibition of human NOD2 expressed in HEK293 cells coexpressing NFkappaB-SEAP reporter measured after 7 to 9 hrs by HEKBIue reporter assay
Ligand InfoPC cidPC sid
In DepthDetails ArticlePubMed
TargetActivin receptor type-1(Homo sapiens (Human))
University Of Houston
Curated by ChEMBL
LigandPNGBDBM50564977(CHEMBL4781705)
Affinity DataIC50:  11nM. Assay description: Inhibition of human ALK2 using casein as substrate in presence of 10 uM [gamma33P] ATP by kinase assay
Ligand InfoPC cidPC sid
In DepthDetails ArticlePubMed