BDBM50565240 CHEMBL4799209
SMILES [H][C@]1(O[C@H]2[C@H](N)C[C@H](N)[C@@H](O[C@@]3([H])O[C@H](CNC(=O)CCCc4cc5ccc6cccc7ccc(c4)c5c67)[C@@H](O)[C@H](O)[C@H]3O)[C@@H]2O)O[C@H](CO)[C@@H](O)[C@H](N)[C@H]1O
InChI Key InChIKey=VKNLXJOULRAFOO-BTEAEAAVSA-N
Data  2 IC50
  Tab Delimited (TSV)   2D SDfile   Computed 3D by Vconf -m prep SDfile
Find this compound or compounds like it in BindingDB:
Activity Spreadsheet -- Enzyme Inhibition Constant Data from BindingDB
Found 2 hits for monomerid = 50565240
TargetGap junction beta-2 protein(Homo sapiens)
Utah State University
Curated by ChEMBL
LigandPNGBDBM50565240(CHEMBL4799209)
Affinity DataIC50:  1.86E+4nM. Assay description: Inhibition of human Cx26 expressed in Escherichia coli LB2003 cells in medium containing 4 mM K+ and 500 uM IPTG by measuring cell growth after 18 hr...
Ligand InfoKEGGPC cidPC sid
In DepthDetails ArticlePubMed
TargetGap junction alpha-1 protein(Homo sapiens)
Utah State University
Curated by ChEMBL
LigandPNGBDBM50565240(CHEMBL4799209)
Affinity DataIC50:  8.60E+3nM. Assay description: Inhibition of human Cx43 expressed in Escherichia coli LB2003 cells in medium containing 8 mM K+ and 10 uM IPTG by measuring cell growth after 18 hrs...
Ligand InfoKEGGPC cidPC sid
In DepthDetails ArticlePubMed