BDBM50565510 CHEMBL4794577
SMILES C[C@H]1C[C@H](C)C(=O)C(C1)[C@H](O)CC1CC(=O)N(CC(=O)NC2C3CC4(C)CC(O)(C3)CC2(C)C4)C(=O)C1
InChI Key InChIKey=PJOHLOWXJFJMOG-DEFXNRNFSA-N
Data  2 IC50
  Tab Delimited (TSV)   2D SDfile   Computed 3D by Vconf -m prep SDfile
Find this compound or compounds like it in BindingDB:
Activity Spreadsheet -- Enzyme Inhibition Constant Data from BindingDB
Found 2 hits for monomerid = 50565510
TargetPeptidyl-prolyl cis-trans isomerase FKBP1A(Homo sapiens (Human))
University Of W£Rzburg
Curated by ChEMBL
LigandPNGBDBM50565510(CHEMBL4794577)
Affinity DataIC50:  220nM. Assay description: Inhibition of human FKBP12 assessed as reduction in PPIase activity using succinyl-Ala-Leu-Pro-Phe-4-nitroanilide as substrate incubated for 4 mins b...
Ligand InfoPC cidPC sid
In DepthDetails ArticlePubMed
TargetOuter membrane protein MIP(Legionella pneumophila)
University Of W£Rzburg
Curated by ChEMBL
LigandPNGBDBM50565510(CHEMBL4794577)
Affinity DataIC50:  4.90E+3nM. Assay description: Inhibition of Legionella pneumophila Mip assessed as reduction in PPIase activity using succinyl-Ala-Leu-Pro-Phe-4-nitroanilide as substrate incubate...
Ligand InfoPC cidPC sid
In DepthDetails ArticlePubMed