BDBM50565994 CHEMBL3596261
SMILES [H][C@@]1(CC[C@@]2([H])[C@]3([H])CC[C@]4([H])C[C@@H](CC[C@]4(C)[C@@]3([H])CC[C@]12C)OC(=O)[C@H](CCC(O)=O)Nc1ccc([N+]([O-])=O)c2nonc12)[C@H](C)CCC(O)=O
InChI Key InChIKey=OFFHHADQGWYMRD-HYFGXOPYSA-N
Data  3 IC50
  Tab Delimited (TSV)   2D SDfile   Computed 3D by Vconf -m prep SDfile
Find this compound or compounds like it in BindingDB:
Activity Spreadsheet -- Enzyme Inhibition Constant Data from BindingDB
Found 3 hits for monomerid = 50565994
LigandPNGBDBM50565994(CHEMBL3596261)
Affinity DataIC50:  900nM. Assay description: Inhibition of rat alpha-2,3-N-ST3GALIII assessed as reduction in sialylated-product formation using Gal-beta1-4Glc and CMP-NeuSAc incubated for 1.5 h...
Ligand InfoPC cidPC sid
In DepthDetails ArticlePubMed
TargetSialyltransferase ST3Gal-I(Rattus norvegicus)
Academia Sinica
Curated by ChEMBL
LigandPNGBDBM50565994(CHEMBL3596261)
Affinity DataIC50:  1.32E+4nM. Assay description: Inhibition of rat alpha-2,3-O-ST3GALI assessed as reduction in sialylated-product formation using p-nitrophenyl T-antigen and CMP-NeuSAc incubated fo...
Ligand InfoPC cidPC sid
In DepthDetails ArticlePubMed
TargetBeta-galactoside alpha-2,6-sialyltransferase 1(Homo sapiens (Human))
Academia Sinica
Curated by ChEMBL
LigandPNGBDBM50565994(CHEMBL3596261)
Affinity DataIC50:  1.50E+3nM. Assay description: Inhibition of human alpha-2,6-ST6GAL1 assessed as reduction in sialylated-product formation using Gal-beta1-4GlcNac and CMP-NeuSAc incubated for 15 m...
Ligand InfoPC cidPC sid
In DepthDetails ArticlePubMed