BDBM50567845 CHEMBL4849022
SMILES Cc1ccc(o1)-c1cncc(Cl)c1N1CCC2(CCNC2=O)CC1
InChI Key InChIKey=YBNHQEFUOGXZRC-UHFFFAOYSA-N
Data  1 KI
  Tab Delimited (TSV)   2D SDfile   Computed 3D by Vconf -m prep SDfile
Find this compound or compounds like it in BindingDB:
Activity Spreadsheet -- Enzyme Inhibition Constant Data from BindingDB
Found 1 hit for monomerid = 50567845
TargetCyclin-C(Homo sapiens (Human))
University Of South Australia
Curated by ChEMBL
LigandPNGBDBM50567845(CHEMBL4849022)
Affinity DataKi:  22nM. Assay description: Inhibition of CDK8/Cyclin C (unknown origin) using RBER-CHKtide as substrate in presence of [32P]gammaATP incubated for 60 mins by microplate scintil...
Ligand InfoPC cidPC sid
In DepthDetails ArticlePubMed