BDBM50567856 CHEMBL4867825
SMILES Clc1cncc(-c2ccc(CN3CCCC3)s2)c1N1CCC2(CCNC2=O)CC1
InChI Key InChIKey=ZLIXNLKVOFWMOW-UHFFFAOYSA-N
Data  1 KI
  Tab Delimited (TSV)   2D SDfile   Computed 3D by Vconf -m prep SDfile
Find this compound or compounds like it in BindingDB:
Activity Spreadsheet -- Enzyme Inhibition Constant Data from BindingDB
Found 1 hit for monomerid = 50567856
TargetCyclin-C(Homo sapiens (Human))
University Of South Australia
Curated by ChEMBL
LigandPNGBDBM50567856(CHEMBL4867825)
Affinity DataKi:  132nM. Assay description: Inhibition of CDK8/Cyclin C (unknown origin) using RBER-CHKtide as substrate in presence of [32P]gammaATP incubated for 60 mins by microplate scintil...
Ligand InfoPC cidPC sid
In DepthDetails ArticlePubMed