BDBM50570309 CHEMBL4868954
SMILES CNc1nc(c(s1)-c1ccnc(Nc2cccc(c2)N2CCCNCC2)n1)C(F)(F)F
InChI Key InChIKey=PSNUTPHNERQRHY-UHFFFAOYSA-N
Data  2 KI
  Tab Delimited (TSV)   2D SDfile   Computed 3D by Vconf -m prep SDfile
Find this compound or compounds like it in BindingDB:
Activity Spreadsheet -- Enzyme Inhibition Constant Data from BindingDB
Found 2 hits for monomerid = 50570309
TargetCyclin-T1/Cyclin-dependent kinase 9(Homo sapiens (Human))
University Of Nottingham
Curated by ChEMBL
LigandPNGBDBM50570309(CHEMBL4868954)
Affinity DataKi:  8nM. Assay description: Inhibition of recombinant human full length CDK9/Cyclin T1 using KTFCGTPEYLAPEVRREPRILSEEEQEMFRDFDYIADWC as substrate incubated for 40 mins in presen...
Ligand InfoPC cidPC sid
In DepthDetails ArticlePubMed
TargetCyclin-A2/Cyclin-dependent kinase 2(Homo sapiens (Human))
University Of Nottingham
Curated by ChEMBL
LigandPNGBDBM50570309(CHEMBL4868954)
Affinity DataKi:  14nM. Assay description: Inhibition of recombinant human full length CDK2/Cyclin A using histone H1 as substrate incubated for 40 mins in presence of [gamma-33P]-ATP by scint...
Ligand InfoPC cidPC sid
In DepthDetails ArticlePubMed