BDBM50571459 CHEMBL4872830
SMILES O=c1cc(cc([nH]1)N1CCCCC[C@@H]1Cc1ccccc1)N1CCOCC1
InChI Key InChIKey=FNNGURVIOIZXRF-LJQANCHMSA-N
Data  5 KI  3 IC50  1 Kd
  Tab Delimited (TSV)   2D SDfile   Computed 3D by Vconf -m prep SDfile
Find this compound or compounds like it in BindingDB:
Activity Spreadsheet -- Enzyme Inhibition Constant Data from BindingDB
Found 9 hits for monomerid = 50571459
TargetSerine-protein kinase ATM(Homo sapiens (Human))TBA
LigandPNGBDBM50571459(CHEMBL4872830)
Affinity DataKi:  1nM. Assay description: Inhibition of rat neutrophil 5- Lipoxygenase (5-LO),
Ligand InfoPC cidPC sid
In DepthDetails PubMed
TargetSerine-protein kinase ATM(Homo sapiens (Human))TBA
LigandPNGBDBM50571459(CHEMBL4872830)
Affinity DataKi:  1nM. Assay description: Inhibition of full length recombinant FLAG-tagged human ATM assessed as decrease in p53 S15 phosphorylation using full length myc-tagged p53 as subst...
Ligand InfoPC cidPC sid
In DepthDetails ArticlePubMed
TargetPhosphatidylinositol 3-kinase catalytic subunit type 3(Homo sapiens (Human))
Charles River
Curated by ChEMBL
LigandPNGBDBM50571459(CHEMBL4872830)
Affinity DataKi:  50nM. Assay description: Inhibition of full length recombinant GST-tagged human VPS34 expressed in baculovirus expression system using PI/PS as substrate incubated for 60 min...
Ligand InfoPC cidPC sid
In DepthDetails ArticlePubMed
TargetPhosphatidylinositol 3-kinase catalytic subunit type 3(Homo sapiens (Human))
Charles River
Curated by ChEMBL
LigandPNGBDBM50571459(CHEMBL4872830)
Affinity DataKi:  50nM. Assay description: Inhibition of rat neutrophil 5- Lipoxygenase (5-LO)
Ligand InfoPC cidPC sid
In DepthDetails PubMed
TargetDNA-dependent protein kinase catalytic subunit(Homo sapiens (Human))
Charles River
Curated by ChEMBL
LigandPNGBDBM50571459(CHEMBL4872830)
Affinity DataKi:  160nM. Assay description: Inhibition of DNA-PK isolated from human HeLa nuclear extract using full length His-tagged p53 as substrate measured after 75 mins in presence of ATP...
Ligand InfoPC cidPC sid
In DepthDetails ArticlePubMed
TargetSerine-protein kinase ATM(Homo sapiens (Human))TBA
LigandPNGBDBM50571459(CHEMBL4872830)
Affinity DataIC50:  230nM. Assay description: Inhibition of rat neutrophil 5- Lipoxygenase (5-LO)
Ligand InfoPC cidPC sid
In DepthDetails PubMed
TargetPhosphatidylinositol 3-kinase catalytic subunit type 3(Homo sapiens (Human))
Charles River
Curated by ChEMBL
LigandPNGBDBM50571459(CHEMBL4872830)
Affinity DataKd:  1.10E+4nM. Assay description: Binding affinity to VPS34 (unknown origin)
Ligand InfoPC cidPC sid
In DepthDetails ArticlePubMed
TargetSerine-protein kinase ATM(Homo sapiens (Human))TBA
LigandPNGBDBM50571459(CHEMBL4872830)
Affinity DataIC50:  230nM. Assay description: Inhibition of ATM in human U2OS cells assessed as reduction in etoposide-stimulated KAP1 phosphorylation incubated for 60 mins by immunoreactivity as...
Ligand InfoPC cidPC sid
In DepthDetails ArticlePubMed
TargetSerine/threonine-protein kinase ATR(Homo sapiens (Human))
Charles River
Curated by ChEMBL
LigandPNGBDBM50571459(CHEMBL4872830)
Affinity DataIC50: >3.00E+4nM. Assay description: Inhibition of ATR in human HT-29 cells assessed as reduction in CHK1 phosphorylation incubated for 4 hrs
Ligand InfoPC cidPC sid
In DepthDetails ArticlePubMed