BDBM50572250 CHEMBL4860496
SMILES OC[C@H]1OC=C[C@@H](OCc2ccc3ccc(cc3n2)C(O)=O)[C@H]1O
InChI Key InChIKey=ZGVBVJVFIXTFPT-BZUAXINKSA-N
Data  7 Kd
PDB links: 1 PDB ID matches this monomer.
  Tab Delimited (TSV)   2D SDfile   Computed 3D by Vconf -m prep SDfile
Find this compound or compounds like it in BindingDB:
Activity Spreadsheet -- Enzyme Inhibition Constant Data from BindingDB
Found 7 hits for monomerid = 50572250
TargetGalectin-4(Homo sapiens (Human))
Lund University
Curated by ChEMBL
LigandPNGBDBM50572250(CHEMBL4860496)
Affinity DataKd:  2.80E+6nM. Assay description: Binding affinity to human galectin-4 C terminal domain assessed as dissociation constant by competitive fluorescence polarization assay
Ligand InfoPC cidPC sidPDB
In DepthDetails ArticlePubMed
TargetGalectin-8(Homo sapiens (Human))
Lund University
Curated by ChEMBL
LigandPNGBDBM50572250(CHEMBL4860496)
Affinity DataKd:  4.80E+4nM. Assay description: Binding affinity to human galectin-8 N terminal domain assessed as dissociation constant by competitive fluorescence polarization assay
Ligand InfoPC cidPC sidPDB
TargetGalectin-8(Homo sapiens (Human))
Lund University
Curated by ChEMBL
LigandPNGBDBM50572250(CHEMBL4860496)
Affinity DataKd:  4.70E+6nM. Assay description: Binding affinity to human galectin-8 C terminal domain assessed as dissociation constant by competitive fluorescence polarization assay
Ligand InfoPC cidPC sidPDB
TargetGalectin-3(Homo sapiens (Human))
Lund University
Curated by ChEMBL
LigandPNGBDBM50572250(CHEMBL4860496)
Affinity DataKd:  5.90E+5nM. Assay description: Binding affinity to human galectin-3 assessed as dissociation constant by competitive fluorescence polarization assay
Ligand InfoPC cidPC sidPDB
In DepthDetails ArticlePubMed
TargetGalectin-1(Homo sapiens (Human))
Lund University
Curated by ChEMBL
LigandPNGBDBM50572250(CHEMBL4860496)
Affinity DataKd:  3.60E+6nM. Assay description: Binding affinity to human galectin-1 assessed as dissociation constant by competitive fluorescence polarization assay
Ligand InfoPC cidPC sidPDB
In DepthDetails ArticlePubMed
TargetGalectin-2(Homo sapiens (Human))
Lund University
Curated by ChEMBL
LigandPNGBDBM50572250(CHEMBL4860496)
Affinity DataKd:  1.10E+6nM. Assay description: Binding affinity to human galectin-2 assessed as dissociation constant by competitive fluorescence polarization assay
Ligand InfoPC cidPC sidPDB
In DepthDetails ArticlePubMed
TargetGalectin-9(Homo sapiens (Human))
Lund University
Curated by ChEMBL
LigandPNGBDBM50572250(CHEMBL4860496)
Affinity DataKd:  1.80E+6nM. Assay description: Binding affinity to human galectin-9 N terminal domain assessed as dissociation constant by competitive fluorescence polarization assay
Ligand InfoPC cidPC sidPDB
In DepthDetails ArticlePubMed