BDBM50573879 CHEMBL4873756
SMILES COc1ccc2nc(C)c(O[C@@H]3C[C@@H]4N(C3)C(=O)[C@H](CCCCC\C=C\[C@@H]3C[C@]3(NC4=O)C(=O)NS(=O)(=O)C3(C)CC3)NC(=O)OC(C)(C)C(F)(F)F)nc2c1
InChI Key InChIKey=ZOQBCVXDXFPSSL-DTAKYVOGSA-N
Data  2 KI
  Tab Delimited (TSV)   2D SDfile   Computed 3D by Vconf -m prep SDfile
Find this compound or compounds like it in BindingDB:
Activity Spreadsheet -- Enzyme Inhibition Constant Data from BindingDB
Found 2 hits for monomerid = 50573879
TargetGenome polyprotein/Non-structural protein 4A(Hepatitis C virus)
University Of Massachusetts Medical School
Curated by ChEMBL
LigandPNGBDBM50573879(CHEMBL4873756)
Affinity DataKi:  2.60nM. Assay description: Inhibition of HCV GT-1a NS3/4a protease using Ac-DE-D(Edans)-EE-Abu-c-[COO]-AS-K(Dabcy1)-NH2 preincubated for 1 hr followed by substrate addition
Ligand InfoPC cidPC sid
In DepthDetails ArticlePubMed
TargetGenome polyprotein/Non-structural protein 4A(Hepatitis C virus)
University Of Massachusetts Medical School
Curated by ChEMBL
LigandPNGBDBM50573879(CHEMBL4873756)
Affinity DataKi:  66nM. Assay description: Inhibition of HCV GT-3a NS3/4a protease using Ac-DE-D(Edans)-EE-Abu-c-[COO]-AS-K(Dabcy1)-NH2 preincubated for 1 hr followed by substrate addition
Ligand InfoPC cidPC sid
In DepthDetails ArticlePubMed