BDBM50574352 CHEMBL4876088
SMILES FC(F)(F)[C@@H]1CN(Cc2cnn3cc(nc3c2)[C@@H](NC(=O)c2nonc2C2CC2)C2CCC(F)(F)CC2)C(=O)N1
InChI Key InChIKey=HJIUUSYTQPKKHD-WMZOPIPTSA-N
Data  1 IC50
  Tab Delimited (TSV)   2D SDfile   Computed 3D by Vconf -m prep SDfile
Find this compound or compounds like it in BindingDB:
Activity Spreadsheet -- Enzyme Inhibition Constant Data from BindingDB
Found 1 hit for monomerid = 50574352
TargetInterleukin-17A(Homo sapiens (Human))
Smith, Gambrell & Russell
Curated by ChEMBL
LigandPNGBDBM50574352(CHEMBL4876088)
Affinity DataIC50:  10nM. Assay description: Inhibition of IL-17A in human HT-29 cells assessed as neutralization measured after 48 hrs by ELISA method
Ligand InfoPC cidPC sid
In DepthDetails ArticlePubMed