BDBM50574353 CHEMBL4860250
SMILES CC(C)c1nonc1C(=O)N[C@@H](C1CCC(F)(F)CC1)c1cn2ncc(CN3C[C@H](NC3=O)C(F)(F)F)cc2n1
InChI Key InChIKey=MLMTVMZWBBFCPF-LPHOPBHVSA-N
Data  1 IC50
  Tab Delimited (TSV)   2D SDfile   Computed 3D by Vconf -m prep SDfile
Find this compound or compounds like it in BindingDB:
Activity Spreadsheet -- Enzyme Inhibition Constant Data from BindingDB
Found 1 hit for monomerid = 50574353
TargetInterleukin-17A(Homo sapiens (Human))
Smith, Gambrell & Russell
Curated by ChEMBL
LigandPNGBDBM50574353(CHEMBL4860250)
Affinity DataIC50:  14nM. Assay description: Inhibition of IL-17A in human HT-29 cells assessed as neutralization measured after 48 hrs by ELISA method
Ligand InfoPC cidPC sid
In DepthDetails ArticlePubMed