BDBM50576210 CHEMBL4859730
SMILES CCN(CC)c1ccc2c(C)c(CCN3CC4(CCN(CC4)c4ncccn4)NC3=O)c(=O)oc2c1
InChI Key InChIKey=KOEPIKQODATHPU-UHFFFAOYSA-N
Data  2 EC50
  Tab Delimited (TSV)   2D SDfile   Computed 3D by Vconf -m prep SDfile
Find this compound or compounds like it in BindingDB:
Activity Spreadsheet -- Enzyme Inhibition Constant Data from BindingDB
Found 2 hits for monomerid = 50576210
TargetImmunoglobulin lambda variable 6-57(Homo sapiens)
The Scripps Research Institute
Curated by ChEMBL
LigandPNGBDBM50576210(CHEMBL4859730)
Affinity DataEC50:  48nM. Assay description: Stabilization of AL patient derived full length fluorescein-labeled IGLV6-57 expressed in Escherichia coli BL21 (DE3) measured after 24 hrs by proteo...
Ligand InfoPC cidPC sid
In DepthDetails ArticlePubMed
TargetImmunoglobulin lambda variable 6-57(Homo sapiens)
The Scripps Research Institute
Curated by ChEMBL
LigandPNGBDBM50576210(CHEMBL4859730)
Affinity DataEC50:  14nM. Assay description: Stabilization of AL patient derived fluorescein-labeled IGLV6-57 T46L/F49Y mutant measured after 24 hrs by proteolysis coupled-fluorescence polarizat...
Ligand InfoPC cidPC sid
In DepthDetails ArticlePubMed