BDBM50576212 CHEMBL4848583
SMILES CCN(CC)c1ccc2c(C)c(CCN3CC4(CCN(CC4)c4nccn5ccnc45)NC3=O)c(=O)oc2c1
InChI Key InChIKey=TZMMGWGOWSOEFN-UHFFFAOYSA-N
Data  2 EC50
  Tab Delimited (TSV)   2D SDfile   Computed 3D by Vconf -m prep SDfile
Find this compound or compounds like it in BindingDB:
Activity Spreadsheet -- Enzyme Inhibition Constant Data from BindingDB
Found 2 hits for monomerid = 50576212
TargetImmunoglobulin lambda variable 6-57(Homo sapiens)
The Scripps Research Institute
Curated by ChEMBL
LigandPNGBDBM50576212(CHEMBL4848583)
Affinity DataEC50:  36nM. Assay description: Stabilization of AL patient derived full length fluorescein-labeled IGLV6-57 expressed in Escherichia coli BL21 (DE3) measured after 24 hrs by proteo...
Ligand InfoPC cidPC sid
In DepthDetails ArticlePubMed
TargetImmunoglobulin lambda variable 6-57(Homo sapiens)
The Scripps Research Institute
Curated by ChEMBL
LigandPNGBDBM50576212(CHEMBL4848583)
Affinity DataEC50:  4.90nM. Assay description: Stabilization of AL patient derived fluorescein-labeled IGLV6-57 T46L/F49Y mutant measured after 24 hrs by proteolysis coupled-fluorescence polarizat...
Ligand InfoPC cidPC sid
In DepthDetails ArticlePubMed